'전체'에 해당되는 글 337건

  1. 2017.11.16 :: highcharts _ linux epoch time 구하기 ( date 명령 이용 )
  2. 2017.07.21 :: ConflictingBeanDefinitionException
  3. 2017.07.12 :: 스파이더맨: 홈커밍 (Spider-Man: Homecoming, 2017)
  4. 2016.11.13 :: 닥터 스트레인지 - Doctor Strange, 2016
  5. 2016.11.12 :: SK T포켓파이 M APN 주소
  6. 2016.10.22 :: 엑스스플릿 유튜브 채팅창 설정 (XSplit Broadcaster) (5)
  7. 2016.10.22 :: 구글크롬 55 베타버전 릴리즈 및 html5test.com 점수 증가 (Chrome)
  8. 2015.11.15 :: openssl 속도 측정 (1)
  9. 2015.09.22 :: • Windows 10 x64 기반 시스템용 Internet Explorer Flash Player 보안 업데이트(KB3087040) - 오류 0x80004005
  10. 2015.06.17 :: Java Bitmap pixel to image(png) setRGB example
  11. 2015.06.17 :: 사용하기 쉬운 쿼리툴 _ DbVisualizer 장단점
  12. 2015.06.15 :: [wonderfl] Lightning Effect (as3)
  13. 2015.04.02 :: Amazon CloudDrive Unlimited Storage Upload / Download Test
  14. 2015.03.26 :: RaspberryPi 2 - redis-benchmark result
  15. 2015.03.26 :: 라즈베리파이 레디스 설치 로그 ( Raspberry redis install history )
  16. 2015.03.23 :: 라즈베리파이 타임존 설정
  17. 2015.03.21 :: IPTIME 공유기 자동업데이트
  18. 2015.03.05 :: [wonderfl] particle 참고 할 샘플
  19. 2015.02.28 :: LG G Pad V410 AT&T GSM Unlocked 7-Inch 4G LTE Wi-Fi 16GB Tablet GPS 성능
  20. 2015.01.14 :: Adobe Flash Player Download Link
  21. 2014.10.31 :: wonderfl - MoviePuzzleTest
  22. 2014.10.29 :: wonderfl-긴 이미지 붙여서 스크룰
  23. 2014.10.28 :: olleh tv 일반매장용 비즈형(기본팩)
  24. 2014.10.20 :: JDK 7 release - Bug Fixes history
  25. 2014.07.28 :: Apache Flex SDK 4.13.0 release
  26. 2014.05.25 :: 인터넷 다운로드시 Olleh KT IPTV 화면 끊김(영상 버퍼링),모자이크 줄이는 방법
  27. 2014.05.11 :: Cannot find 'XINPUT1_3.dll', Please, re-install this application
  28. 2014.05.11 :: Daum API 부트캠프(BootCamp)2014
  29. 2013.10.06 :: 광명시민운동장 주변 소음공해 (소음 공해) / 광명 시민운동장
  30. 2013.07.02 :: eclipse @author 변경하기
Computer_IT/HTML5 2017.11.16 15:39

1. highcharts / datetime / csv 에서 사용하기 위한   linux epoch time 구하기

2. highcharts 등에서 x axis 값 타입을 datetime 형식으로 사용할때  테스트 용도


linux (date)

] date -d "2017-11-16 13:00:01" -u  +%s

1510837201


] date -d "2017-11-16 14:00:02" -u  +%s

1510840802


] date -d "2017-11-16 15:00:03" -u  +%s

1510844403


csv 데이터 ( 뒤에 000을 붙여서 13자리로 만듬 )

1510837201000,10

1510840802000,20

1510844403000,30


highcharts 옵션

highcharts 옵션에서...

    options = {

  global: {

            useUTC: false

        }, 

        xAxis : {

          type: 'datetime'

        }


결과


'Computer_IT > HTML5' 카테고리의 다른 글

highcharts _ linux epoch time 구하기 ( date 명령 이용 )  (0) 2017.11.16
posted by 고급코드 고급코드
Computer_IT/오류메세지 2017.07.21 04:23

Caused by: org.springframework.context.annotation.ConflictingBeanDefinitionException: Annotation-specified bean name 'blablabla' for bean class [com.helloworld] conflicts with existing, non-compatible bean definition of same name and class [com.helloworld]


원인

output(compile)된 class 찌꺼기에서 anotation 중복이 발생


해결 방법 

compile된 class 경로 가서 과거 생성된 파일들을 지워 준다.

posted by 고급코드 고급코드
Anime&Movies 2017.07.12 19:43


스파이더맨: 홈커밍 (Spider-Man: Homecoming, 2017) 엔딩 쿠키 영상


1. 영화 끝난뒤  쿠키 1개

2. 제작자 이름들 모두 지나간뒤 추가 쿠키 1개

총2개

posted by 고급코드 고급코드
Anime&Movies 2016.11.13 14:55

image

 

닥터 스트레인지 쿠키 영상 2개

바로 끝난뒤 : 1

제작진 크레딧 지나간뒤에 : 1

 

 

image

posted by 고급코드 고급코드
HardWare 2016.11.12 21:52

apn : lte-internet.sktelecom.com

image

posted by 고급코드 고급코드
Computer_IT/Youtube 2016.10.22 12:10

 

XSplit 사용시 유튜브 채팅창 화면상에 추가하기 (브라우저 팝업 X)

Youtube 나 Twitch.tv 등은 채팅 API가 공개되어있어서 Third Party가 채팅 내용을 접근 가능함.

물론 XSplit도 가능

 

 


소스 –> 더 많은 소스 보기

 


가장 마지막의 Youtube Live Ch… 선택
비슷한게 2가지가 있음.
1. IRC 버전  ( IRC 버전이 좀더 빠름 )
2. WebSocket 버전 / via HTML5 라고 표기된 버전



[INSTALL] 선택 하여 설치

 

Other 의 Youtube Live Chat Viewer (Beta) 선택

 


추가된것 확인 (아직은 Youtube와 연계되지 않은 상태)

우측 마우스 버튼 선택 및 하단 에서 선택후  [설정] 선택

 


Youtube Chat 설정창 확인

Account 의 Authorize XSPlit to use Youtube Live  선택후 아래의 Google 인증과정 진행

 

 

 


자신의 채널 선택

 


[허용] 선택

 


인증 완료후 자신의 채널이 표시됨

 


Live Chats 에서 현재 설정된 스트리밍 항목 선택

 

이제 방송전 테스트

 


youtube 홈 화면의 우측 자신의 앰블럼 선택후 크리에이터 스튜디오 선택

 


좌측 실시간 스트리밍 / 지금 스트리밍하기[베타] 선택

 


우측의 채팅창 확인

 

이곳에다 메시지를 적어서 테스트 가능

 


인증과정을 거쳐 서로 연계가 이루어진 상태이기 떄문에 메시지를 적는 즉시 화면상 표시가됨

 


 


Opacity 로 투명도 조절
메모리에 소스 유지[체크 추천] 화면 전환시 이어서 전환됨

 

아래의 다양한 탭항목의 값을 조절하여 자신에 맞는 환경 설정

 

 

 

 

 

실제 사용 사례


[대도서관 방송중…]

'Computer_IT > Youtube' 카테고리의 다른 글

엑스스플릿 유튜브 채팅창 설정 (XSplit Broadcaster)  (5) 2016.10.22
posted by 고급코드 고급코드
새 소식 2016.10.22 10:30

 

평소 Chrome의 Beta(Dev) 버전으로 사용중 Chrome Beta 55가 릴리즈 되어 http://html5test.com 에서 점수를 확인해봄

 

기존 Chrome 54 버전

 

 

 

업데이트된  Chrome 55 개발자 버전

 

 

 

스코어 증가에 영향을 준 항목

(우측이 Chrome 55)

Pointer Events 추가

 

 

우측이 Chrome 55

Async and Await 추가

posted by 고급코드 고급코드


단순 참고용...




사용커맨드

> openssl speed -evp aes256 -elapsed




Synology  NAS 712+

CPU : Intel Atom D425 Monocore (1C/2T) 1.8GHz x86 Processor

SYNONAS> openssl speed -evp aes256 -elapsed      

You have chosen to measure elapsed time instead of user CPU time.

Doing aes-256-cbc for 3s on 16 size blocks: 620447 aes-256-cbc's in 3.01s

Doing aes-256-cbc for 3s on 64 size blocks: 183449 aes-256-cbc's in 3.00s

Doing aes-256-cbc for 3s on 256 size blocks: 75143 aes-256-cbc's in 3.00s

Doing aes-256-cbc for 3s on 1024 size blocks: 13415 aes-256-cbc's in 3.00s

Doing aes-256-cbc for 3s on 8192 size blocks: 2000 aes-256-cbc's in 3.00s

OpenSSL 1.0.1p-fips 9 Jul 2015

built on: Wed Oct 28 12:37:18 2015

options:bn(64,32) rc4(8x,mmx) des(ptr,risc1,16,long) aes(partial) idea(int) blowfish(idx) 

compiler: /usr/local/i686-pc-linux-gnu/bin/i686-pc-linux-gnu-ccache-gcc -I. -I.. -I../include  -fPIC -DOPENSSL_PIC -DOPENSSL_THREADS -D_REENTRANT -DDSO_DLFCN -DHAVE_DLFCN_H -I/usr/local/i686-pc-linux-gnu/i686-pc-linux-gnu/sys-root/usr/include -DSYNO_X64 -O2 -I/usr/syno/include -DSYNO_ARCH=32 -D_LARGEFILE64_SOURCE -D_FILE_OFFSET_BITS=64 -DSYNO_PLATFORM=X64 -g -pipe -DOPENSSL_NO_ERR -DL_ENDIAN -O3 -fomit-frame-pointer -Wall -DOPENSSL_BN_ASM_PART_WORDS -DOPENSSL_IA32_SSE2 -DOPENSSL_BN_ASM_MONT -DOPENSSL_BN_ASM_GF2m -I/usr/syno//include -DSHA1_ASM -DSHA256_ASM -DSHA512_ASM -DMD5_ASM -DRMD160_ASM -DAES_ASM -DVPAES_ASM -DWHIRLPOOL_ASM -DGHASH_ASM

The 'numbers' are in 1000s of bytes per second processed.

type             16 bytes     64 bytes    256 bytes   1024 bytes   8192 bytes

aes-256-cbc       3298.06k     3913.58k     6412.20k     4578.99k     5461.33k



Rasberry PI 2 

CPU : Broadcom BCM2836 (CPU, GPU, DSP, SDRAM) 900 MHz quad-core ARM Cortex A7 (ARMv7 instruction set)

pi@raspi ~ $ openssl speed -evp aes256 -elapsed      

You have chosen to measure elapsed time instead of user CPU time.

Doing aes-256-cbc for 3s on 16 size blocks: 2704173 aes-256-cbc's in 3.00s

Doing aes-256-cbc for 3s on 64 size blocks: 752159 aes-256-cbc's in 3.00s

Doing aes-256-cbc for 3s on 256 size blocks: 193098 aes-256-cbc's in 3.00s

Doing aes-256-cbc for 3s on 1024 size blocks: 48585 aes-256-cbc's in 3.00s

Doing aes-256-cbc for 3s on 8192 size blocks: 6092 aes-256-cbc's in 3.00s

OpenSSL 1.0.1k 8 Jan 2015

built on: Sat Jun 13 16:36:02 2015

options:bn(64,32) rc4(ptr,char) des(idx,cisc,16,long) aes(partial) blowfish(ptr) 

compiler: -I. -I.. -I../include  -fPIC -DOPENSSL_PIC -DOPENSSL_THREADS -D_REENTRANT -DDSO_DLFCN -DHAVE_DLFCN_H -DL_ENDIAN -DTERMIO -g -O2 -fstack-protector-strong -Wformat -Werror=format-security -D_FORTIFY_SOURCE=2 -Wl,-z,relro -Wa,--noexecstack -Wall -DOPENSSL_BN_ASM_MONT -DOPENSSL_BN_ASM_GF2m -DSHA1_ASM -DSHA256_ASM -DSHA512_ASM -DAES_ASM -DGHASH_ASM

The 'numbers' are in 1000s of bytes per second processed.

type             16 bytes     64 bytes    256 bytes   1024 bytes   8192 bytes

aes-256-cbc      14422.26k    16046.06k    16477.70k    16583.68k    16635.22k



WD My Cloud

CPU : Comcerto 2000 EVM (ARMv7 Processor rev 1 (v7l))

WDMyCloud:/CacheVolume/upgrade# openssl speed -evp aes256 -elapsed
You have chosen to measure elapsed time instead of user CPU time.
Doing aes-256-cbc for 3s on 16 size blocks: 2802523 aes-256-cbc's in 3.00s
Doing aes-256-cbc for 3s on 64 size blocks: 782065 aes-256-cbc's in 3.00s
Doing aes-256-cbc for 3s on 256 size blocks: 203568 aes-256-cbc's in 3.00s
Doing aes-256-cbc for 3s on 1024 size blocks: 51526 aes-256-cbc's in 3.00s
Doing aes-256-cbc for 3s on 8192 size blocks: 6466 aes-256-cbc's in 3.00s
OpenSSL 1.0.1m 19 Mar 2015
built on: Fri Mar 27 03:10:40 2015
options:bn(64,32) rc4(ptr,char) des(idx,cisc,16,long) aes(partial) blowfish(ptr) 
compiler: gcc -I. -I.. -I../include  -fPIC -DOPENSSL_PIC -DOPENSSL_THREADS -D_REENTRANT -DDSO_DLFCN -DHAVE_DLFCN_H -DL_ENDIAN -DTERMIO -g -O2 -fstack-protector-strong -Wformat -Werror=format-security -D_FORTIFY_SOURCE=2 -Wl,-z,relro -Wa,--noexecstack -Wall -DOPENSSL_BN_ASM_MONT -DOPENSSL_BN_ASM_GF2m -DSHA1_ASM -DSHA256_ASM -DSHA512_ASM -DAES_ASM -DGHASH_ASM
The 'numbers' are in 1000s of bytes per second processed.
type             16 bytes     64 bytes    256 bytes   1024 bytes   8192 bytes
aes-256-cbc      14946.79k    16684.05k    17371.14k    17587.54k    17656.49k



odroid XU4

cpu : Samsung Exynos5422 Cortex™-A15 2Ghz and Cortex™-A7 Octa core CPUs

odroid@odroid:~$ openssl speed -evp aes256 -elapsed      

You have chosen to measure elapsed time instead of user CPU time.

Doing aes-256-cbc for 3s on 16 size blocks: 11501687 aes-256-cbc's in 3.00s

Doing aes-256-cbc for 3s on 64 size blocks: 3188790 aes-256-cbc's in 3.01s

Doing aes-256-cbc for 3s on 256 size blocks: 828341 aes-256-cbc's in 3.00s

Doing aes-256-cbc for 3s on 1024 size blocks: 209031 aes-256-cbc's in 3.00s

Doing aes-256-cbc for 3s on 8192 size blocks: 26222 aes-256-cbc's in 3.00s

OpenSSL 1.0.2d 9 Jul 2015

built on: reproducible build, date unspecified

options:bn(64,32) rc4(ptr,char) des(idx,cisc,16,long) aes(partial) blowfish(ptr) 

compiler: cc -I. -I.. -I../include  -fPIC -DOPENSSL_PIC -DOPENSSL_THREADS -D_REENTRANT -DDSO_DLFCN -DHAVE_DLFCN_H -DL_ENDIAN -g -O2 -fstack-protector-strong -Wformat -Werror=format-security -D_FORTIFY_SOURCE=2 -Wl,-Bsymbolic-functions -Wl,-z,relro -Wa,--noexecstack -Wall -DOPENSSL_BN_ASM_MONT -DOPENSSL_BN_ASM_GF2m -DSHA1_ASM -DSHA256_ASM -DSHA512_ASM -DAES_ASM -DBSAES_ASM -DGHASH_ASM

The 'numbers' are in 1000s of bytes per second processed.

type             16 bytes     64 bytes    256 bytes   1024 bytes   8192 bytes

aes-256-cbc      61342.33k    67801.51k    70685.10k    71349.25k    71603.54k



pine64 - 2g

ubuntu@localhost:~$ openssl speed -evp aes256 -elapsed

You have chosen to measure elapsed time instead of user CPU time.

Doing aes-256-cbc for 3s on 16 size blocks: 24274186 aes-256-cbc's in 3.00s

Doing aes-256-cbc for 3s on 64 size blocks: 14124698 aes-256-cbc's in 3.00s

Doing aes-256-cbc for 3s on 256 size blocks: 5183353 aes-256-cbc's in 3.00s

Doing aes-256-cbc for 3s on 1024 size blocks: 1500357 aes-256-cbc's in 3.00s

Doing aes-256-cbc for 3s on 8192 size blocks: 192865 aes-256-cbc's in 3.00s

OpenSSL 1.0.2g-fips  1 Mar 2016

built on: reproducible build, date unspecified

options:bn(64,64) rc4(ptr,char) des(idx,cisc,16,int) aes(partial) blowfish(ptr) 

compiler: cc -I. -I.. -I../include  -fPIC -DOPENSSL_PIC -DOPENSSL_THREADS -D_REENTRANT -DDSO_DLFCN -DHAVE_DLFCN_H -DL_ENDIAN -g -O2 -fstack-protector-strong -Wformat -Werror=format-security -Wdate-time -D_FORTIFY_SOURCE=2 -Wl,-Bsymbolic-functions -Wl,-z,relro -Wa,--noexecstack -Wall -DSHA1_ASM -DSHA256_ASM -DSHA512_ASM

The 'numbers' are in 1000s of bytes per second processed.

type             16 bytes     64 bytes    256 bytes   1024 bytes   8192 bytes

aes-256-cbc     129462.33k   301326.89k   442312.79k   512121.86k   526650.03k



Intel I5 3570-3.4G

C:\>openssl speed -evp aes256 -elapsed

WARNING: can't open config file: f:\repo\winlibs_openssl_vc11_x86/openssl.cnf

You have chosen to measure elapsed time instead of user CPU time.

Doing aes-256-cbc for 3s on 16 size blocks: 88348330 aes-256-cbc's in 3.00s

Doing aes-256-cbc for 3s on 64 size blocks: 23161673 aes-256-cbc's in 3.00s

Doing aes-256-cbc for 3s on 256 size blocks: 5846825 aes-256-cbc's in 3.00s

Doing aes-256-cbc for 3s on 1024 size blocks: 1471089 aes-256-cbc's in 3.00s

Doing aes-256-cbc for 3s on 8192 size blocks: 183546 aes-256-cbc's in 3.00s

OpenSSL 1.0.1i 6 Aug 2014

built on: Thu Aug  7 17:22:15 2014

options:bn(64,64) rc4(16x,int) des(idx,cisc,2,long) aes(partial) idea(int) blowf

ish(idx)

compiler: cl  /MD /Ox -DOPENSSL_THREADS  -DDSO_WIN32 -W3 -Gs0 -Gy -nologo -DOPEN

SSL_SYSNAME_WIN32 -DWIN32_LEAN_AND_MEAN -DL_ENDIAN -DUNICODE -D_UNICODE -D_CRT_S

ECURE_NO_DEPRECATE -DOPENSSL_IA32_SSE2 -DOPENSSL_BN_ASM_MONT -DOPENSSL_BN_ASM_MO

NT5 -DOPENSSL_BN_ASM_GF2m -DSHA1_ASM -DSHA256_ASM -DSHA512_ASM -DMD5_ASM -DAES_A

SM -DVPAES_ASM -DBSAES_ASM -DWHIRLPOOL_ASM -DGHASH_ASM -DOPENSSL_USE_APPLINK -I.

 -DOPENSSL_NO_RC5 -DOPENSSL_NO_MD2 -DOPENSSL_NO_KRB5 -DOPENSSL_NO_JPAKE -DOPENSS

L_NO_DYNAMIC_ENGINE

The 'numbers' are in 1000s of bytes per second processed.

type             16 bytes     64 bytes    256 bytes   1024 bytes   8192 bytes

aes-256-cbc     471034.08k   493951.04k   498762.81k   502131.71k   500869.03k


posted by 고급코드 고급코드
Computer_IT/오류메세지 2015.09.22 08:38



• Windows 10 x64 기반 시스템용 Internet Explorer Flash Player 보안 업데이트(KB3087040) - 오류 0x80004005


긴급 Flash 보안 업데이트 중의 하나인 KB3087040 업데이트가 

위처럼 메시지가 뜨면서 Flash 업데이트가 안될경우



x86 Windows 10.

http://download.windowsupdate.com/d/msdownload/update/software/secu/2015/09/windows10.0-kb3087040-x86_86b760ce3097391e6896df374d69aff46b769b02.msu


x64 Windows 10.

http://download.windowsupdate.com/d/msdownload/update/software/secu/2015/09/windows10.0-kb3087040-x64_ad0f78efb7b122fa9472dbb8050c4f358aceab49.msu




직접 다운받아서 설치후 재부팅 하면 업데이트 완료!








업데이트후에도 위와 같은 메시지가 뜰수 있으나 업데이트 확인을 한번 하면 메시지가 없어진것을 확인할수 있음.



Edge 와 InternetExplorer 11의 Flash 버전이 바뀐것을 확인!


posted by 고급코드 고급코드
Computer_IT/JAVA 2015.06.17 23:55

Java에서 Bitmap을 Pixel 단위로 처리 할때 샘플...


 

Source...

import java.awt.image.BufferedImage;

import java.io.File;

import java.io.IOException;


import javax.imageio.ImageIO;


public class BufferedImagePixels {

public static void main(String[] args) {


BufferedImage bufferedImage = new BufferedImage(300, 300,

BufferedImage.TYPE_INT_RGB);


int rgb = bufferedImage.getRGB(1, 1);


int w = bufferedImage.getWidth(null);

int h = bufferedImage.getHeight(null);

int[] rgbs = new int[w * h];

bufferedImage.getRGB(0, 0, w, h, rgbs, 0, w);


rgb = 0xFF00FF00; // green


for (int i = 1; i < w; i++) {

bufferedImage.setRGB(i, i, rgb);

}


File outputfile = new File("c:\\image.png");

try {

// png, 

ImageIO.write(bufferedImage, "png", outputfile);

} catch (IOException e) {

e.printStackTrace();

}


}

}


결과...


'Computer_IT > JAVA' 카테고리의 다른 글

Java Bitmap pixel to image(png) setRGB example  (0) 2015.06.17
JDK 7 release - Bug Fixes history  (0) 2014.10.20
eclipse @author 변경하기  (0) 2013.07.02
jackson parser sample  (0) 2013.04.02
VisualSVN Post-commit hook  (0) 2013.02.04
마이피플 위젯 전송 자바 샘플  (0) 2012.07.11
posted by 고급코드 고급코드
Computer_IT/DBMS 2015.06.17 20:49





DB_JDBC설정DB_JDBC설정

JDBC설정 화면




URL Format과 DriverClass 를 Ctrl+C , Ctrl+V만 해도 기본적인 DB연결 문자열은 바로 생성 가능

Class.forName("net.sourceforge.jtds.jdbc.Driver");

conn = DriverManager.getConnection("jdbc:jtds:sqlserver://<server>:<port1433>;DatabaseName=<database>", "user", "password");







장점 : 

1. Java기반으로 제작된 프로그램

2. Java개발시 사용되는 JDBC연결을 통해 JDBC를 지원하는 모든 DB연결가능

    (지원되지 않는 DB라도 JDBC 드라이버만 있으면 기본적인 연결 및 쿼리 가능) ex) Cubrid, Tibero

3. 상용 프로그램으로 꾸준한 업데이트 지원

4. 데이터를 손쉽게 Chart로 표현 가능

5. 설치된경로\resources\profiles 에 DB별로 조회가능한 Dictionary 조회 쿼리 존재

6. DB별로 특성화된 구조로 표현




단점 :

1. 대량의 데이터 Fetch 시에 Memory 점유율(Java메모리)이 높음

2. 무료로 사용가능하나 무료버전은 많은 기능이 제약됨

3. LongRun 쿼리 Stop이 불가할땐 재시작 해야함

4. 범용성을 지니다 보니 전문적인 admin 부분에선 약함

5. 초반 설치시 Editor에서 한글을 사용하기 위해선 한글 Font 지정 필요

   Tools->Tool Properties -> [General] -> General -> Apperance -> Fonts

6. Pro버전 라이센스가 비쌈-1copy $179 (여러 DB를 사용해야 하는 직업을 가진 사람은 적당한 툴)



지원 기능 설명 : http://www.dbvis.com/features/

다운로드 링크 : http://www.dbvis.com/download/


'Computer_IT > DBMS' 카테고리의 다른 글

사용하기 쉬운 쿼리툴 _ DbVisualizer 장단점  (0) 2015.06.17
h2 database utc time select  (0) 2013.05.21
DB2 - SNAPSHOT  (0) 2010.10.29
DB2  (0) 2010.10.28
[DBMS] DB2의 SQL 한계  (0) 2008.11.10
db2 db configuration 확인  (0) 2008.07.08
posted by 고급코드 고급코드
TAG dbvis, Java, JDBC, Query
Computer_IT/FLEX_AIR 2015.06.15 08:59




http://wonderfl.net/c/8Z2I



'Computer_IT > FLEX_AIR' 카테고리의 다른 글

[wonderfl] Lightning Effect (as3)  (0) 2015.06.15
[wonderfl] particle 참고 할 샘플  (0) 2015.03.05
Adobe Flash Player Download Link  (0) 2015.01.14
wonderfl - MoviePuzzleTest  (0) 2014.10.31
wonderfl-긴 이미지 붙여서 스크룰  (0) 2014.10.29
Apache Flex SDK 4.13.0 release  (0) 2014.07.28
posted by 고급코드 고급코드
Media 2015.04.02 02:09






아마존 클라우드 드라이브 사용할지에 대해 고민하던중 업로드, 다운로드 속도 테스트 , 단순 참고용

KT - 100M



https://www.amazon.com/clouddrive/unlimited


posted by 고급코드 고급코드

pi@raspberrypi ~/redis-2.8.19/src $ ./redis-benchmark 

====== PING_INLINE ======

  100000 requests completed in 6.84 seconds

  50 parallel clients

  3 bytes payload

  keep alive: 1


0.00% <= 1 milliseconds

27.08% <= 2 milliseconds

83.75% <= 3 milliseconds

96.20% <= 4 milliseconds

99.61% <= 5 milliseconds

99.89% <= 6 milliseconds

99.98% <= 7 milliseconds

99.99% <= 8 milliseconds

100.00% <= 8 milliseconds

14613.47 requests per second


====== PING_BULK ======

  100000 requests completed in 7.02 seconds

  50 parallel clients

  3 bytes payload

  keep alive: 1


0.00% <= 1 milliseconds

82.06% <= 2 milliseconds

99.45% <= 3 milliseconds

100.00% <= 3 milliseconds

14247.04 requests per second


[8838] 26 Mar 22:51:21.842 * 100 changes in 300 seconds. Saving...

[8838] 26 Mar 22:51:21.843 * Background saving started by pid 8849

[8849] 26 Mar 22:51:21.861 * DB saved on disk

[8849] 26 Mar 22:51:21.864 * RDB: 0 MB of memory used by copy-on-write

[8838] 26 Mar 22:51:21.945 * Background saving terminated with success

====== SET ======

  100000 requests completed in 7.51 seconds

  50 parallel clients

  3 bytes payload

  keep alive: 1


0.00% <= 1 milliseconds

0.26% <= 2 milliseconds

15.47% <= 3 milliseconds

79.39% <= 4 milliseconds

93.76% <= 5 milliseconds

98.51% <= 6 milliseconds

98.92% <= 7 milliseconds

99.13% <= 8 milliseconds

99.41% <= 9 milliseconds

99.86% <= 10 milliseconds

99.97% <= 11 milliseconds

100.00% <= 12 milliseconds

100.00% <= 12 milliseconds

13317.35 requests per second


====== GET ======

  100000 requests completed in 6.97 seconds

  50 parallel clients

  3 bytes payload

  keep alive: 1


0.00% <= 1 milliseconds

30.21% <= 2 milliseconds

84.57% <= 3 milliseconds

97.20% <= 4 milliseconds

99.83% <= 5 milliseconds

99.94% <= 6 milliseconds

100.00% <= 7 milliseconds

100.00% <= 7 milliseconds

14345.14 requests per second


====== INCR ======

  100000 requests completed in 7.67 seconds

  50 parallel clients

  3 bytes payload

  keep alive: 1


0.00% <= 1 milliseconds

0.11% <= 2 milliseconds

8.53% <= 3 milliseconds

80.30% <= 4 milliseconds

90.93% <= 5 milliseconds

99.45% <= 6 milliseconds

99.74% <= 7 milliseconds

99.99% <= 8 milliseconds

100.00% <= 8 milliseconds

13041.21 requests per second


====== LPUSH ======

  100000 requests completed in 7.65 seconds

  50 parallel clients

  3 bytes payload

  keep alive: 1


0.00% <= 1 milliseconds

0.12% <= 2 milliseconds

8.43% <= 3 milliseconds

80.21% <= 4 milliseconds

90.69% <= 5 milliseconds

99.31% <= 6 milliseconds

99.71% <= 7 milliseconds

99.98% <= 8 milliseconds

100.00% <= 8 milliseconds

13075.31 requests per second


====== LPOP ======

  100000 requests completed in 7.39 seconds

  50 parallel clients

  3 bytes payload

  keep alive: 1


0.00% <= 1 milliseconds

0.37% <= 2 milliseconds

20.85% <= 3 milliseconds

80.13% <= 4 milliseconds

94.46% <= 5 milliseconds

98.94% <= 6 milliseconds

99.60% <= 7 milliseconds

99.91% <= 8 milliseconds

100.00% <= 8 milliseconds

13529.97 requests per second


====== SADD ======

  100000 requests completed in 7.31 seconds

  50 parallel clients

  3 bytes payload

  keep alive: 1


0.00% <= 1 milliseconds

0.26% <= 2 milliseconds

18.35% <= 3 milliseconds

80.69% <= 4 milliseconds

95.68% <= 5 milliseconds

99.43% <= 6 milliseconds

99.83% <= 7 milliseconds

100.00% <= 8 milliseconds

100.00% <= 8 milliseconds

13678.02 requests per second


====== SPOP ======

  100000 requests completed in 6.80 seconds

  50 parallel clients

  3 bytes payload

  keep alive: 1


0.00% <= 1 milliseconds

49.03% <= 2 milliseconds

93.90% <= 3 milliseconds

99.67% <= 4 milliseconds

99.98% <= 5 milliseconds

100.00% <= 5 milliseconds

14705.88 requests per second


====== LPUSH (needed to benchmark LRANGE) ======

  100000 requests completed in 7.67 seconds

  50 parallel clients

  3 bytes payload

  keep alive: 1


0.00% <= 1 milliseconds

0.07% <= 2 milliseconds

7.12% <= 3 milliseconds

80.79% <= 4 milliseconds

90.10% <= 5 milliseconds

99.25% <= 6 milliseconds

99.67% <= 7 milliseconds

99.96% <= 8 milliseconds

100.00% <= 11 milliseconds

13044.61 requests per second


[8838] 26 Mar 22:52:22.074 * 10000 changes in 60 seconds. Saving...

[8838] 26 Mar 22:52:22.075 * Background saving started by pid 8850

[8850] 26 Mar 22:52:22.327 * DB saved on disk

[8850] 26 Mar 22:52:22.330 * RDB: 0 MB of memory used by copy-on-write

[8838] 26 Mar 22:52:22.379 * Background saving terminated with success

====== LRANGE_100 (first 100 elements) ======

  100000 requests completed in 22.43 seconds

  50 parallel clients

  3 bytes payload

  keep alive: 1


0.00% <= 3 milliseconds

0.01% <= 4 milliseconds

0.86% <= 5 milliseconds

90.79% <= 6 milliseconds

99.46% <= 7 milliseconds

99.65% <= 8 milliseconds

99.72% <= 9 milliseconds

99.80% <= 10 milliseconds

99.85% <= 11 milliseconds

99.89% <= 12 milliseconds

99.96% <= 13 milliseconds

99.99% <= 14 milliseconds

100.00% <= 14 milliseconds

4458.71 requests per second


====== LRANGE_300 (first 300 elements) ======

  100000 requests completed in 59.10 seconds

  50 parallel clients

  3 bytes payload

  keep alive: 1


0.00% <= 3 milliseconds

0.00% <= 4 milliseconds

0.00% <= 5 milliseconds

0.01% <= 6 milliseconds

0.01% <= 7 milliseconds

0.01% <= 8 milliseconds

0.02% <= 9 milliseconds

0.03% <= 10 milliseconds

0.12% <= 11 milliseconds

0.80% <= 12 milliseconds

6.19% <= 13 milliseconds

27.69% <= 14 milliseconds

64.12% <= 15 milliseconds

89.81% <= 16 milliseconds

98.40% <= 17 milliseconds

99.73% <= 18 milliseconds

99.93% <= 19 milliseconds

99.95% <= 20 milliseconds

99.96% <= 21 milliseconds

99.97% <= 22 milliseconds

99.98% <= 23 milliseconds

99.98% <= 24 milliseconds

99.99% <= 25 milliseconds

99.99% <= 26 milliseconds

100.00% <= 27 milliseconds

100.00% <= 28 milliseconds

100.00% <= 28 milliseconds

1691.93 requests per second


====== LRANGE_500 (first 450 elements) ======

  100000 requests completed in 83.56 seconds

  50 parallel clients

  3 bytes payload

  keep alive: 1


0.00% <= 3 milliseconds

0.00% <= 4 milliseconds

0.00% <= 5 milliseconds

0.00% <= 6 milliseconds

0.01% <= 7 milliseconds

0.01% <= 10 milliseconds

0.01% <= 11 milliseconds

0.01% <= 12 milliseconds

0.01% <= 13 milliseconds

0.02% <= 14 milliseconds

0.05% <= 15 milliseconds

0.12% <= 16 milliseconds

0.28% <= 17 milliseconds

1.12% <= 18 milliseconds

6.05% <= 19 milliseconds

25.01% <= 20 milliseconds

68.55% <= 21 milliseconds

91.51% <= 22 milliseconds

97.99% <= 23 milliseconds

99.52% <= 24 milliseconds

99.82% <= 25 milliseconds

99.89% <= 26 milliseconds

99.95% <= 27 milliseconds

99.97% <= 28 milliseconds

99.97% <= 29 milliseconds

99.98% <= 30 milliseconds

99.98% <= 31 milliseconds

99.98% <= 36 milliseconds

99.98% <= 37 milliseconds

99.99% <= 38 milliseconds

99.99% <= 39 milliseconds

99.99% <= 40 milliseconds

99.99% <= 41 milliseconds

99.99% <= 42 milliseconds

99.99% <= 43 milliseconds

100.00% <= 44 milliseconds

100.00% <= 45 milliseconds

100.00% <= 46 milliseconds

100.00% <= 47 milliseconds

100.00% <= 48 milliseconds

1196.73 requests per second


====== LRANGE_600 (first 600 elements) ======

  100000 requests completed in 109.33 seconds

  50 parallel clients

  3 bytes payload

  keep alive: 1


0.00% <= 3 milliseconds

0.00% <= 4 milliseconds

0.00% <= 5 milliseconds

0.00% <= 6 milliseconds

0.01% <= 7 milliseconds

0.01% <= 8 milliseconds

0.01% <= 9 milliseconds

0.01% <= 10 milliseconds

0.01% <= 11 milliseconds

0.02% <= 12 milliseconds

0.02% <= 13 milliseconds

0.02% <= 14 milliseconds

0.02% <= 15 milliseconds

0.03% <= 16 milliseconds

0.03% <= 17 milliseconds

0.04% <= 18 milliseconds

0.06% <= 19 milliseconds

0.16% <= 20 milliseconds

0.33% <= 21 milliseconds

0.77% <= 22 milliseconds

2.57% <= 23 milliseconds

6.88% <= 24 milliseconds

16.61% <= 25 milliseconds

31.92% <= 26 milliseconds

48.75% <= 27 milliseconds

65.71% <= 28 milliseconds

81.48% <= 29 milliseconds

92.03% <= 30 milliseconds

97.02% <= 31 milliseconds

99.04% <= 32 milliseconds

99.55% <= 33 milliseconds

99.74% <= 34 milliseconds

99.88% <= 35 milliseconds

99.91% <= 36 milliseconds

99.92% <= 37 milliseconds

99.93% <= 38 milliseconds

99.93% <= 39 milliseconds

99.94% <= 40 milliseconds

99.94% <= 41 milliseconds

99.94% <= 42 milliseconds

99.95% <= 43 milliseconds

99.95% <= 44 milliseconds

99.96% <= 45 milliseconds

99.96% <= 46 milliseconds

99.96% <= 47 milliseconds

99.97% <= 48 milliseconds

99.97% <= 49 milliseconds

99.98% <= 50 milliseconds

99.98% <= 51 milliseconds

99.98% <= 52 milliseconds

99.98% <= 53 milliseconds

99.98% <= 54 milliseconds

99.98% <= 55 milliseconds

99.98% <= 56 milliseconds

99.98% <= 57 milliseconds

99.99% <= 58 milliseconds

99.99% <= 59 milliseconds

99.99% <= 60 milliseconds

99.99% <= 61 milliseconds

99.99% <= 62 milliseconds

100.00% <= 63 milliseconds

100.00% <= 64 milliseconds

100.00% <= 65 milliseconds

914.62 requests per second


[8838] 26 Mar 22:56:56.672 * 10000 changes in 60 seconds. Saving...

[8838] 26 Mar 22:56:56.674 * Background saving started by pid 8851

[8851] 26 Mar 22:56:56.953 * DB saved on disk

[8851] 26 Mar 22:56:56.956 * RDB: 0 MB of memory used by copy-on-write

[8838] 26 Mar 22:56:56.981 * Background saving terminated with success

====== MSET (10 keys) ======

  100000 requests completed in 13.93 seconds

  50 parallel clients

  3 bytes payload

  keep alive: 1


0.00% <= 2 milliseconds

0.04% <= 3 milliseconds

0.04% <= 4 milliseconds

0.07% <= 5 milliseconds

0.79% <= 6 milliseconds

86.61% <= 7 milliseconds

91.39% <= 8 milliseconds

96.34% <= 9 milliseconds

98.89% <= 10 milliseconds

99.75% <= 11 milliseconds

99.82% <= 12 milliseconds

99.94% <= 13 milliseconds

99.97% <= 14 milliseconds

99.98% <= 15 milliseconds

100.00% <= 16 milliseconds

100.00% <= 16 milliseconds

7177.21 requests per second



pi@raspberrypi ~/redis-2.8.19/src $ [8838] 26 Mar 22:57:57.005 * 10000 changes in 60 seconds. Saving...

[8838] 26 Mar 22:57:57.007 * Background saving started by pid 8852

[8852] 26 Mar 22:57:57.281 * DB saved on disk

[8852] 26 Mar 22:57:57.284 * RDB: 0 MB of memory used by copy-on-write

[8838] 26 Mar 22:57:57.309 * Background saving terminated with success


posted by 고급코드 고급코드

pi@raspberrypi ~/redis-2.8.19 $ uname -a

Linux raspberrypi 3.18.7-v7+ #755 SMP PREEMPT Thu Feb 12 17:20:48 GMT 2015 armv7l GNU/Linux



pi@raspberrypi ~ $ wget http://download.redis.io/releases/redis-2.8.19.tar.gz

--2015-03-26 22:03:56--  http://download.redis.io/releases/redis-2.8.19.tar.gz

Resolving download.redis.io (download.redis.io)... 109.74.203.151

Connecting to download.redis.io (download.redis.io)|109.74.203.151|:80... connected.

HTTP request sent, awaiting response... 200 OK

Length: 1254857 (1.2M) [application/x-gzip]

Saving to: `redis-2.8.19.tar.gz'


100%[====================================================================================================================================>] 1,254,857    588K/s   in 2.1s    


2015-03-26 22:03:59 (588 KB/s) - `redis-2.8.19.tar.gz' saved [1254857/1254857]


pi@raspberrypi ~ $ tar xvf redis-2.8.19.tar.gz 

redis-2.8.19/

redis-2.8.19/.gitignore

redis-2.8.19/00-RELEASENOTES

redis-2.8.19/BUGS

redis-2.8.19/CONTRIBUTING

redis-2.8.19/COPYING

redis-2.8.19/INSTALL

redis-2.8.19/MANIFESTO

redis-2.8.19/Makefile

redis-2.8.19/README

redis-2.8.19/deps/

redis-2.8.19/deps/Makefile

redis-2.8.19/deps/hiredis/

redis-2.8.19/deps/hiredis/.gitignore

redis-2.8.19/deps/hiredis/.travis.yml

redis-2.8.19/deps/hiredis/CHANGELOG.md

redis-2.8.19/deps/hiredis/COPYING

redis-2.8.19/deps/hiredis/Makefile

redis-2.8.19/deps/hiredis/README.md

redis-2.8.19/deps/hiredis/adapters/

redis-2.8.19/deps/hiredis/adapters/ae.h

redis-2.8.19/deps/hiredis/adapters/libev.h

redis-2.8.19/deps/hiredis/adapters/libevent.h

redis-2.8.19/deps/hiredis/adapters/libuv.h

redis-2.8.19/deps/hiredis/async.c

redis-2.8.19/deps/hiredis/async.h

redis-2.8.19/deps/hiredis/dict.c

redis-2.8.19/deps/hiredis/dict.h

redis-2.8.19/deps/hiredis/examples/

redis-2.8.19/deps/hiredis/examples/example-ae.c

redis-2.8.19/deps/hiredis/examples/example-libev.c

redis-2.8.19/deps/hiredis/examples/example-libevent.c

redis-2.8.19/deps/hiredis/examples/example-libuv.c

redis-2.8.19/deps/hiredis/examples/example.c

redis-2.8.19/deps/hiredis/fmacros.h

redis-2.8.19/deps/hiredis/hiredis.c

redis-2.8.19/deps/hiredis/hiredis.h

redis-2.8.19/deps/hiredis/net.c

redis-2.8.19/deps/hiredis/net.h

redis-2.8.19/deps/hiredis/sds.c

redis-2.8.19/deps/hiredis/sds.h

redis-2.8.19/deps/hiredis/test.c

redis-2.8.19/deps/hiredis/zmalloc.h

redis-2.8.19/deps/jemalloc/

redis-2.8.19/deps/jemalloc/.gitignore

redis-2.8.19/deps/jemalloc/COPYING

redis-2.8.19/deps/jemalloc/ChangeLog

redis-2.8.19/deps/jemalloc/INSTALL

redis-2.8.19/deps/jemalloc/Makefile.in

redis-2.8.19/deps/jemalloc/README

redis-2.8.19/deps/jemalloc/VERSION

redis-2.8.19/deps/jemalloc/autogen.sh

redis-2.8.19/deps/jemalloc/bin/

redis-2.8.19/deps/jemalloc/bin/jemalloc.sh.in

redis-2.8.19/deps/jemalloc/bin/pprof

redis-2.8.19/deps/jemalloc/config.guess

redis-2.8.19/deps/jemalloc/config.stamp.in

redis-2.8.19/deps/jemalloc/config.sub

redis-2.8.19/deps/jemalloc/configure

redis-2.8.19/deps/jemalloc/configure.ac

redis-2.8.19/deps/jemalloc/coverage.sh

redis-2.8.19/deps/jemalloc/doc/

redis-2.8.19/deps/jemalloc/doc/html.xsl.in

redis-2.8.19/deps/jemalloc/doc/jemalloc.3

redis-2.8.19/deps/jemalloc/doc/jemalloc.html

redis-2.8.19/deps/jemalloc/doc/jemalloc.xml.in

redis-2.8.19/deps/jemalloc/doc/manpages.xsl.in

redis-2.8.19/deps/jemalloc/doc/stylesheet.xsl

redis-2.8.19/deps/jemalloc/include/

redis-2.8.19/deps/jemalloc/include/jemalloc/

redis-2.8.19/deps/jemalloc/include/jemalloc/internal/

redis-2.8.19/deps/jemalloc/include/jemalloc/internal/arena.h

redis-2.8.19/deps/jemalloc/include/jemalloc/internal/atomic.h

redis-2.8.19/deps/jemalloc/include/jemalloc/internal/base.h

redis-2.8.19/deps/jemalloc/include/jemalloc/internal/bitmap.h

redis-2.8.19/deps/jemalloc/include/jemalloc/internal/chunk.h

redis-2.8.19/deps/jemalloc/include/jemalloc/internal/chunk_dss.h

redis-2.8.19/deps/jemalloc/include/jemalloc/internal/chunk_mmap.h

redis-2.8.19/deps/jemalloc/include/jemalloc/internal/ckh.h

redis-2.8.19/deps/jemalloc/include/jemalloc/internal/ctl.h

redis-2.8.19/deps/jemalloc/include/jemalloc/internal/extent.h

redis-2.8.19/deps/jemalloc/include/jemalloc/internal/hash.h

redis-2.8.19/deps/jemalloc/include/jemalloc/internal/huge.h

redis-2.8.19/deps/jemalloc/include/jemalloc/internal/jemalloc_internal.h.in

redis-2.8.19/deps/jemalloc/include/jemalloc/internal/jemalloc_internal_defs.h.in

redis-2.8.19/deps/jemalloc/include/jemalloc/internal/jemalloc_internal_macros.h

redis-2.8.19/deps/jemalloc/include/jemalloc/internal/mb.h

redis-2.8.19/deps/jemalloc/include/jemalloc/internal/mutex.h

redis-2.8.19/deps/jemalloc/include/jemalloc/internal/private_namespace.sh

redis-2.8.19/deps/jemalloc/include/jemalloc/internal/private_symbols.txt

redis-2.8.19/deps/jemalloc/include/jemalloc/internal/private_unnamespace.sh

redis-2.8.19/deps/jemalloc/include/jemalloc/internal/prng.h

redis-2.8.19/deps/jemalloc/include/jemalloc/internal/prof.h

redis-2.8.19/deps/jemalloc/include/jemalloc/internal/public_namespace.sh

redis-2.8.19/deps/jemalloc/include/jemalloc/internal/public_unnamespace.sh

redis-2.8.19/deps/jemalloc/include/jemalloc/internal/ql.h

redis-2.8.19/deps/jemalloc/include/jemalloc/internal/qr.h

redis-2.8.19/deps/jemalloc/include/jemalloc/internal/quarantine.h

redis-2.8.19/deps/jemalloc/include/jemalloc/internal/rb.h

redis-2.8.19/deps/jemalloc/include/jemalloc/internal/rtree.h

redis-2.8.19/deps/jemalloc/include/jemalloc/internal/size_classes.sh

redis-2.8.19/deps/jemalloc/include/jemalloc/internal/stats.h

redis-2.8.19/deps/jemalloc/include/jemalloc/internal/tcache.h

redis-2.8.19/deps/jemalloc/include/jemalloc/internal/tsd.h

redis-2.8.19/deps/jemalloc/include/jemalloc/internal/util.h

redis-2.8.19/deps/jemalloc/include/jemalloc/jemalloc.sh

redis-2.8.19/deps/jemalloc/include/jemalloc/jemalloc_defs.h.in

redis-2.8.19/deps/jemalloc/include/jemalloc/jemalloc_macros.h.in

redis-2.8.19/deps/jemalloc/include/jemalloc/jemalloc_mangle.sh

redis-2.8.19/deps/jemalloc/include/jemalloc/jemalloc_protos.h.in

redis-2.8.19/deps/jemalloc/include/jemalloc/jemalloc_rename.sh

redis-2.8.19/deps/jemalloc/include/msvc_compat/

redis-2.8.19/deps/jemalloc/include/msvc_compat/inttypes.h

redis-2.8.19/deps/jemalloc/include/msvc_compat/stdbool.h

redis-2.8.19/deps/jemalloc/include/msvc_compat/stdint.h

redis-2.8.19/deps/jemalloc/include/msvc_compat/strings.h

redis-2.8.19/deps/jemalloc/install-sh

redis-2.8.19/deps/jemalloc/src/

redis-2.8.19/deps/jemalloc/src/arena.c

redis-2.8.19/deps/jemalloc/src/atomic.c

redis-2.8.19/deps/jemalloc/src/base.c

redis-2.8.19/deps/jemalloc/src/bitmap.c

redis-2.8.19/deps/jemalloc/src/chunk.c

redis-2.8.19/deps/jemalloc/src/chunk_dss.c

redis-2.8.19/deps/jemalloc/src/chunk_mmap.c

redis-2.8.19/deps/jemalloc/src/ckh.c

redis-2.8.19/deps/jemalloc/src/ctl.c

redis-2.8.19/deps/jemalloc/src/extent.c

redis-2.8.19/deps/jemalloc/src/hash.c

redis-2.8.19/deps/jemalloc/src/huge.c

redis-2.8.19/deps/jemalloc/src/jemalloc.c

redis-2.8.19/deps/jemalloc/src/mb.c

redis-2.8.19/deps/jemalloc/src/mutex.c

redis-2.8.19/deps/jemalloc/src/prof.c

redis-2.8.19/deps/jemalloc/src/quarantine.c

redis-2.8.19/deps/jemalloc/src/rtree.c

redis-2.8.19/deps/jemalloc/src/stats.c

redis-2.8.19/deps/jemalloc/src/tcache.c

redis-2.8.19/deps/jemalloc/src/tsd.c

redis-2.8.19/deps/jemalloc/src/util.c

redis-2.8.19/deps/jemalloc/src/zone.c

redis-2.8.19/deps/jemalloc/test/

redis-2.8.19/deps/jemalloc/test/include/

redis-2.8.19/deps/jemalloc/test/include/test/

redis-2.8.19/deps/jemalloc/test/include/test/SFMT-alti.h

redis-2.8.19/deps/jemalloc/test/include/test/SFMT-params.h

redis-2.8.19/deps/jemalloc/test/include/test/SFMT-params11213.h

redis-2.8.19/deps/jemalloc/test/include/test/SFMT-params1279.h

redis-2.8.19/deps/jemalloc/test/include/test/SFMT-params132049.h

redis-2.8.19/deps/jemalloc/test/include/test/SFMT-params19937.h

redis-2.8.19/deps/jemalloc/test/include/test/SFMT-params216091.h

redis-2.8.19/deps/jemalloc/test/include/test/SFMT-params2281.h

redis-2.8.19/deps/jemalloc/test/include/test/SFMT-params4253.h

redis-2.8.19/deps/jemalloc/test/include/test/SFMT-params44497.h

redis-2.8.19/deps/jemalloc/test/include/test/SFMT-params607.h

redis-2.8.19/deps/jemalloc/test/include/test/SFMT-params86243.h

redis-2.8.19/deps/jemalloc/test/include/test/SFMT-sse2.h

redis-2.8.19/deps/jemalloc/test/include/test/SFMT.h

redis-2.8.19/deps/jemalloc/test/include/test/jemalloc_test.h.in

redis-2.8.19/deps/jemalloc/test/include/test/jemalloc_test_defs.h.in

redis-2.8.19/deps/jemalloc/test/include/test/math.h

redis-2.8.19/deps/jemalloc/test/include/test/mq.h

redis-2.8.19/deps/jemalloc/test/include/test/mtx.h

redis-2.8.19/deps/jemalloc/test/include/test/test.h

redis-2.8.19/deps/jemalloc/test/include/test/thd.h

redis-2.8.19/deps/jemalloc/test/integration/

redis-2.8.19/deps/jemalloc/test/integration/MALLOCX_ARENA.c

redis-2.8.19/deps/jemalloc/test/integration/aligned_alloc.c

redis-2.8.19/deps/jemalloc/test/integration/allocated.c

redis-2.8.19/deps/jemalloc/test/integration/allocm.c

redis-2.8.19/deps/jemalloc/test/integration/mallocx.c

redis-2.8.19/deps/jemalloc/test/integration/mremap.c

redis-2.8.19/deps/jemalloc/test/integration/posix_memalign.c

redis-2.8.19/deps/jemalloc/test/integration/rallocm.c

redis-2.8.19/deps/jemalloc/test/integration/rallocx.c

redis-2.8.19/deps/jemalloc/test/integration/thread_arena.c

redis-2.8.19/deps/jemalloc/test/integration/thread_tcache_enabled.c

redis-2.8.19/deps/jemalloc/test/integration/xallocx.c

redis-2.8.19/deps/jemalloc/test/src/

redis-2.8.19/deps/jemalloc/test/src/SFMT.c

redis-2.8.19/deps/jemalloc/test/src/math.c

redis-2.8.19/deps/jemalloc/test/src/mtx.c

redis-2.8.19/deps/jemalloc/test/src/test.c

redis-2.8.19/deps/jemalloc/test/src/thd.c

redis-2.8.19/deps/jemalloc/test/test.sh.in

redis-2.8.19/deps/jemalloc/test/unit/

redis-2.8.19/deps/jemalloc/test/unit/SFMT.c

redis-2.8.19/deps/jemalloc/test/unit/bitmap.c

redis-2.8.19/deps/jemalloc/test/unit/ckh.c

redis-2.8.19/deps/jemalloc/test/unit/hash.c

redis-2.8.19/deps/jemalloc/test/unit/junk.c

redis-2.8.19/deps/jemalloc/test/unit/mallctl.c

redis-2.8.19/deps/jemalloc/test/unit/math.c

redis-2.8.19/deps/jemalloc/test/unit/mq.c

redis-2.8.19/deps/jemalloc/test/unit/mtx.c

redis-2.8.19/deps/jemalloc/test/unit/prof_accum.c

redis-2.8.19/deps/jemalloc/test/unit/prof_accum.h

redis-2.8.19/deps/jemalloc/test/unit/prof_accum_a.c

redis-2.8.19/deps/jemalloc/test/unit/prof_accum_b.c

redis-2.8.19/deps/jemalloc/test/unit/prof_gdump.c

redis-2.8.19/deps/jemalloc/test/unit/prof_idump.c

redis-2.8.19/deps/jemalloc/test/unit/ql.c

redis-2.8.19/deps/jemalloc/test/unit/qr.c

redis-2.8.19/deps/jemalloc/test/unit/quarantine.c

redis-2.8.19/deps/jemalloc/test/unit/rb.c

redis-2.8.19/deps/jemalloc/test/unit/rtree.c

redis-2.8.19/deps/jemalloc/test/unit/stats.c

redis-2.8.19/deps/jemalloc/test/unit/tsd.c

redis-2.8.19/deps/jemalloc/test/unit/util.c

redis-2.8.19/deps/jemalloc/test/unit/zero.c

redis-2.8.19/deps/linenoise/

redis-2.8.19/deps/linenoise/.gitignore

redis-2.8.19/deps/linenoise/Makefile

redis-2.8.19/deps/linenoise/README.markdown

redis-2.8.19/deps/linenoise/example.c

redis-2.8.19/deps/linenoise/linenoise.c

redis-2.8.19/deps/linenoise/linenoise.h

redis-2.8.19/deps/lua/

redis-2.8.19/deps/lua/COPYRIGHT

redis-2.8.19/deps/lua/HISTORY

redis-2.8.19/deps/lua/INSTALL

redis-2.8.19/deps/lua/Makefile

redis-2.8.19/deps/lua/README

redis-2.8.19/deps/lua/doc/

redis-2.8.19/deps/lua/doc/contents.html

redis-2.8.19/deps/lua/doc/cover.png

redis-2.8.19/deps/lua/doc/logo.gif

redis-2.8.19/deps/lua/doc/lua.1

redis-2.8.19/deps/lua/doc/lua.css

redis-2.8.19/deps/lua/doc/lua.html

redis-2.8.19/deps/lua/doc/luac.1

redis-2.8.19/deps/lua/doc/luac.html

redis-2.8.19/deps/lua/doc/manual.css

redis-2.8.19/deps/lua/doc/manual.html

redis-2.8.19/deps/lua/doc/readme.html

redis-2.8.19/deps/lua/etc/

redis-2.8.19/deps/lua/etc/Makefile

redis-2.8.19/deps/lua/etc/README

redis-2.8.19/deps/lua/etc/all.c

redis-2.8.19/deps/lua/etc/lua.hpp

redis-2.8.19/deps/lua/etc/lua.ico

redis-2.8.19/deps/lua/etc/lua.pc

redis-2.8.19/deps/lua/etc/luavs.bat

redis-2.8.19/deps/lua/etc/min.c

redis-2.8.19/deps/lua/etc/noparser.c

redis-2.8.19/deps/lua/etc/strict.lua

redis-2.8.19/deps/lua/src/

redis-2.8.19/deps/lua/src/Makefile

redis-2.8.19/deps/lua/src/fpconv.c

redis-2.8.19/deps/lua/src/fpconv.h

redis-2.8.19/deps/lua/src/lapi.c

redis-2.8.19/deps/lua/src/lapi.h

redis-2.8.19/deps/lua/src/lauxlib.c

redis-2.8.19/deps/lua/src/lauxlib.h

redis-2.8.19/deps/lua/src/lbaselib.c

redis-2.8.19/deps/lua/src/lcode.c

redis-2.8.19/deps/lua/src/lcode.h

redis-2.8.19/deps/lua/src/ldblib.c

redis-2.8.19/deps/lua/src/ldebug.c

redis-2.8.19/deps/lua/src/ldebug.h

redis-2.8.19/deps/lua/src/ldo.c

redis-2.8.19/deps/lua/src/ldo.h

redis-2.8.19/deps/lua/src/ldump.c

redis-2.8.19/deps/lua/src/lfunc.c

redis-2.8.19/deps/lua/src/lfunc.h

redis-2.8.19/deps/lua/src/lgc.c

redis-2.8.19/deps/lua/src/lgc.h

redis-2.8.19/deps/lua/src/linit.c

redis-2.8.19/deps/lua/src/liolib.c

redis-2.8.19/deps/lua/src/llex.c

redis-2.8.19/deps/lua/src/llex.h

redis-2.8.19/deps/lua/src/llimits.h

redis-2.8.19/deps/lua/src/lmathlib.c

redis-2.8.19/deps/lua/src/lmem.c

redis-2.8.19/deps/lua/src/lmem.h

redis-2.8.19/deps/lua/src/loadlib.c

redis-2.8.19/deps/lua/src/lobject.c

redis-2.8.19/deps/lua/src/lobject.h

redis-2.8.19/deps/lua/src/lopcodes.c

redis-2.8.19/deps/lua/src/lopcodes.h

redis-2.8.19/deps/lua/src/loslib.c

redis-2.8.19/deps/lua/src/lparser.c

redis-2.8.19/deps/lua/src/lparser.h

redis-2.8.19/deps/lua/src/lstate.c

redis-2.8.19/deps/lua/src/lstate.h

redis-2.8.19/deps/lua/src/lstring.c

redis-2.8.19/deps/lua/src/lstring.h

redis-2.8.19/deps/lua/src/lstrlib.c

redis-2.8.19/deps/lua/src/ltable.c

redis-2.8.19/deps/lua/src/ltable.h

redis-2.8.19/deps/lua/src/ltablib.c

redis-2.8.19/deps/lua/src/ltm.c

redis-2.8.19/deps/lua/src/ltm.h

redis-2.8.19/deps/lua/src/lua.c

redis-2.8.19/deps/lua/src/lua.h

redis-2.8.19/deps/lua/src/lua_bit.c

redis-2.8.19/deps/lua/src/lua_cjson.c

redis-2.8.19/deps/lua/src/lua_cmsgpack.c

redis-2.8.19/deps/lua/src/lua_struct.c

redis-2.8.19/deps/lua/src/luac.c

redis-2.8.19/deps/lua/src/luaconf.h

redis-2.8.19/deps/lua/src/lualib.h

redis-2.8.19/deps/lua/src/lundump.c

redis-2.8.19/deps/lua/src/lundump.h

redis-2.8.19/deps/lua/src/lvm.c

redis-2.8.19/deps/lua/src/lvm.h

redis-2.8.19/deps/lua/src/lzio.c

redis-2.8.19/deps/lua/src/lzio.h

redis-2.8.19/deps/lua/src/print.c

redis-2.8.19/deps/lua/src/strbuf.c

redis-2.8.19/deps/lua/src/strbuf.h

redis-2.8.19/deps/lua/test/

redis-2.8.19/deps/lua/test/README

redis-2.8.19/deps/lua/test/bisect.lua

redis-2.8.19/deps/lua/test/cf.lua

redis-2.8.19/deps/lua/test/echo.lua

redis-2.8.19/deps/lua/test/env.lua

redis-2.8.19/deps/lua/test/factorial.lua

redis-2.8.19/deps/lua/test/fib.lua

redis-2.8.19/deps/lua/test/fibfor.lua

redis-2.8.19/deps/lua/test/globals.lua

redis-2.8.19/deps/lua/test/hello.lua

redis-2.8.19/deps/lua/test/life.lua

redis-2.8.19/deps/lua/test/luac.lua

redis-2.8.19/deps/lua/test/printf.lua

redis-2.8.19/deps/lua/test/readonly.lua

redis-2.8.19/deps/lua/test/sieve.lua

redis-2.8.19/deps/lua/test/sort.lua

redis-2.8.19/deps/lua/test/table.lua

redis-2.8.19/deps/lua/test/trace-calls.lua

redis-2.8.19/deps/lua/test/trace-globals.lua

redis-2.8.19/deps/lua/test/xd.lua

redis-2.8.19/deps/update-jemalloc.sh

redis-2.8.19/redis.conf

redis-2.8.19/runtest

redis-2.8.19/runtest-sentinel

redis-2.8.19/sentinel.conf

redis-2.8.19/src/

redis-2.8.19/src/.gitignore

redis-2.8.19/src/Makefile

redis-2.8.19/src/Makefile.dep

redis-2.8.19/src/adlist.c

redis-2.8.19/src/adlist.h

redis-2.8.19/src/ae.c

redis-2.8.19/src/ae.h

redis-2.8.19/src/ae_epoll.c

redis-2.8.19/src/ae_evport.c

redis-2.8.19/src/ae_kqueue.c

redis-2.8.19/src/ae_select.c

redis-2.8.19/src/anet.c

redis-2.8.19/src/anet.h

redis-2.8.19/src/aof.c

redis-2.8.19/src/asciilogo.h

redis-2.8.19/src/bio.c

redis-2.8.19/src/bio.h

redis-2.8.19/src/bitops.c

redis-2.8.19/src/config.c

redis-2.8.19/src/config.h

redis-2.8.19/src/crc64.c

redis-2.8.19/src/crc64.h

redis-2.8.19/src/db.c

redis-2.8.19/src/debug.c

redis-2.8.19/src/dict.c

redis-2.8.19/src/dict.h

redis-2.8.19/src/endianconv.c

redis-2.8.19/src/endianconv.h

redis-2.8.19/src/fmacros.h

redis-2.8.19/src/help.h

redis-2.8.19/src/hyperloglog.c

redis-2.8.19/src/intset.c

redis-2.8.19/src/intset.h

redis-2.8.19/src/latency.c

redis-2.8.19/src/latency.h

redis-2.8.19/src/lzf.h

redis-2.8.19/src/lzfP.h

redis-2.8.19/src/lzf_c.c

redis-2.8.19/src/lzf_d.c

redis-2.8.19/src/memtest.c

redis-2.8.19/src/migrate.c

redis-2.8.19/src/mkreleasehdr.sh

redis-2.8.19/src/multi.c

redis-2.8.19/src/networking.c

redis-2.8.19/src/notify.c

redis-2.8.19/src/object.c

redis-2.8.19/src/pqsort.c

redis-2.8.19/src/pqsort.h

redis-2.8.19/src/pubsub.c

redis-2.8.19/src/rand.c

redis-2.8.19/src/rand.h

redis-2.8.19/src/rdb.c

redis-2.8.19/src/rdb.h

redis-2.8.19/src/redis-benchmark.c

redis-2.8.19/src/redis-check-aof.c

redis-2.8.19/src/redis-check-dump.c

redis-2.8.19/src/redis-cli.c

redis-2.8.19/src/redis.c

redis-2.8.19/src/redis.h

redis-2.8.19/src/redisassert.h

redis-2.8.19/src/release.c

redis-2.8.19/src/replication.c

redis-2.8.19/src/rio.c

redis-2.8.19/src/rio.h

redis-2.8.19/src/scripting.c

redis-2.8.19/src/sds.c

redis-2.8.19/src/sds.h

redis-2.8.19/src/sentinel.c

redis-2.8.19/src/setproctitle.c

redis-2.8.19/src/sha1.c

redis-2.8.19/src/sha1.h

redis-2.8.19/src/slowlog.c

redis-2.8.19/src/slowlog.h

redis-2.8.19/src/solarisfixes.h

redis-2.8.19/src/sort.c

redis-2.8.19/src/sparkline.c

redis-2.8.19/src/sparkline.h

redis-2.8.19/src/syncio.c

redis-2.8.19/src/t_hash.c

redis-2.8.19/src/t_list.c

redis-2.8.19/src/t_set.c

redis-2.8.19/src/t_string.c

redis-2.8.19/src/t_zset.c

redis-2.8.19/src/testhelp.h

redis-2.8.19/src/util.c

redis-2.8.19/src/util.h

redis-2.8.19/src/valgrind.sup

redis-2.8.19/src/version.h

redis-2.8.19/src/ziplist.c

redis-2.8.19/src/ziplist.h

redis-2.8.19/src/zipmap.c

redis-2.8.19/src/zipmap.h

redis-2.8.19/src/zmalloc.c

redis-2.8.19/src/zmalloc.h

redis-2.8.19/tests/

redis-2.8.19/tests/assets/

redis-2.8.19/tests/assets/default.conf

redis-2.8.19/tests/assets/encodings.rdb

redis-2.8.19/tests/assets/hash-zipmap.rdb

redis-2.8.19/tests/helpers/

redis-2.8.19/tests/helpers/bg_complex_data.tcl

redis-2.8.19/tests/helpers/gen_write_load.tcl

redis-2.8.19/tests/instances.tcl

redis-2.8.19/tests/integration/

redis-2.8.19/tests/integration/aof-race.tcl

redis-2.8.19/tests/integration/aof.tcl

redis-2.8.19/tests/integration/convert-zipmap-hash-on-load.tcl

redis-2.8.19/tests/integration/rdb.tcl

redis-2.8.19/tests/integration/redis-cli.tcl

redis-2.8.19/tests/integration/replication-2.tcl

redis-2.8.19/tests/integration/replication-3.tcl

redis-2.8.19/tests/integration/replication-4.tcl

redis-2.8.19/tests/integration/replication-psync.tcl

redis-2.8.19/tests/integration/replication.tcl

redis-2.8.19/tests/sentinel/

redis-2.8.19/tests/sentinel/run.tcl

redis-2.8.19/tests/sentinel/tests/

redis-2.8.19/tests/sentinel/tests/00-base.tcl

redis-2.8.19/tests/sentinel/tests/01-conf-update.tcl

redis-2.8.19/tests/sentinel/tests/02-slaves-reconf.tcl

redis-2.8.19/tests/sentinel/tests/03-runtime-reconf.tcl

redis-2.8.19/tests/sentinel/tests/04-slave-selection.tcl

redis-2.8.19/tests/sentinel/tests/05-manual.tcl

redis-2.8.19/tests/sentinel/tests/includes/

redis-2.8.19/tests/sentinel/tests/includes/init-tests.tcl

redis-2.8.19/tests/sentinel/tmp/

redis-2.8.19/tests/sentinel/tmp/.gitignore

redis-2.8.19/tests/support/

redis-2.8.19/tests/support/redis.tcl

redis-2.8.19/tests/support/server.tcl

redis-2.8.19/tests/support/test.tcl

redis-2.8.19/tests/support/tmpfile.tcl

redis-2.8.19/tests/support/util.tcl

redis-2.8.19/tests/test_helper.tcl

redis-2.8.19/tests/tmp/

redis-2.8.19/tests/tmp/.gitignore

redis-2.8.19/tests/unit/

redis-2.8.19/tests/unit/aofrw.tcl

redis-2.8.19/tests/unit/auth.tcl

redis-2.8.19/tests/unit/basic.tcl

redis-2.8.19/tests/unit/bitops.tcl

redis-2.8.19/tests/unit/dump.tcl

redis-2.8.19/tests/unit/expire.tcl

redis-2.8.19/tests/unit/hyperloglog.tcl

redis-2.8.19/tests/unit/introspection.tcl

redis-2.8.19/tests/unit/latency-monitor.tcl

redis-2.8.19/tests/unit/limits.tcl

redis-2.8.19/tests/unit/maxmemory.tcl

redis-2.8.19/tests/unit/memefficiency.tcl

redis-2.8.19/tests/unit/multi.tcl

redis-2.8.19/tests/unit/obuf-limits.tcl

redis-2.8.19/tests/unit/other.tcl

redis-2.8.19/tests/unit/printver.tcl

redis-2.8.19/tests/unit/protocol.tcl

redis-2.8.19/tests/unit/pubsub.tcl

redis-2.8.19/tests/unit/quit.tcl

redis-2.8.19/tests/unit/scan.tcl

redis-2.8.19/tests/unit/scripting.tcl

redis-2.8.19/tests/unit/slowlog.tcl

redis-2.8.19/tests/unit/sort.tcl

redis-2.8.19/tests/unit/type/

redis-2.8.19/tests/unit/type/hash.tcl

redis-2.8.19/tests/unit/type/list-2.tcl

redis-2.8.19/tests/unit/type/list-3.tcl

redis-2.8.19/tests/unit/type/list-common.tcl

redis-2.8.19/tests/unit/type/list.tcl

redis-2.8.19/tests/unit/type/set.tcl

redis-2.8.19/tests/unit/type/zset.tcl

redis-2.8.19/utils/

redis-2.8.19/utils/build-static-symbols.tcl

redis-2.8.19/utils/generate-command-help.rb

redis-2.8.19/utils/hyperloglog/

redis-2.8.19/utils/hyperloglog/.gitignore

redis-2.8.19/utils/hyperloglog/hll-err.rb

redis-2.8.19/utils/hyperloglog/hll-gnuplot-graph.rb

redis-2.8.19/utils/install_server.sh

redis-2.8.19/utils/mkrelease.sh

redis-2.8.19/utils/redis-copy.rb

redis-2.8.19/utils/redis-sha1.rb

redis-2.8.19/utils/redis_init_script

redis-2.8.19/utils/redis_init_script.tpl

redis-2.8.19/utils/speed-regression.tcl

redis-2.8.19/utils/whatisdoing.sh

pi@raspberrypi ~ $ cd redis-2.8.19/

pi@raspberrypi ~/redis-2.8.19 $ ls -alrt

합계 148

drwxr-xr-x  3 pi pi  4096 12월 16 17:18 utils

drwxr-xr-x  9 pi pi  4096 12월 16 17:18 tests

drwxr-xr-x  2 pi pi  4096 12월 16 17:18 src

-rw-r--r--  1 pi pi  7109 12월 16 17:18 sentinel.conf

-rwxr-xr-x  1 pi pi   281 12월 16 17:18 runtest-sentinel

-rwxr-xr-x  1 pi pi   271 12월 16 17:18 runtest

-rw-r--r--  1 pi pi 36141 12월 16 17:18 redis.conf

drwxr-xr-x  6 pi pi  4096 12월 16 17:18 deps

-rw-r--r--  1 pi pi  4404 12월 16 17:18 README

-rw-r--r--  1 pi pi   151 12월 16 17:18 Makefile

-rw-r--r--  1 pi pi  4223 12월 16 17:18 MANIFESTO

-rw-r--r--  1 pi pi    11 12월 16 17:18 INSTALL

-rw-r--r--  1 pi pi  1487 12월 16 17:18 COPYING

-rw-r--r--  1 pi pi  1439 12월 16 17:18 CONTRIBUTING

-rw-r--r--  1 pi pi    53 12월 16 17:18 BUGS

-rw-r--r--  1 pi pi 30972 12월 16 17:18 00-RELEASENOTES

-rw-r--r--  1 pi pi   332 12월 16 17:18 .gitignore

drwxr-xr-x  6 pi pi  4096 12월 16 17:18 .

drwxr-xr-x 11 pi pi  4096  3월 26 22:04 ..

pi@raspberrypi ~/redis-2.8.19 $ make

cd src && make all

make[1]: Entering directory '/home/pi/redis-2.8.19/src'

rm -rf redis-server redis-sentinel redis-cli redis-benchmark redis-check-dump redis-check-aof *.o *.gcda *.gcno *.gcov redis.info lcov-html

(cd ../deps && make distclean)

make[2]: Entering directory '/home/pi/redis-2.8.19/deps'

(cd hiredis && make clean) > /dev/null || true

(cd linenoise && make clean) > /dev/null || true

(cd lua && make clean) > /dev/null || true

(cd jemalloc && [ -f Makefile ] && make distclean) > /dev/null || true

(rm -f .make-*)

make[2]: Leaving directory '/home/pi/redis-2.8.19/deps'

(rm -f .make-*)

echo STD=-std=c99 -pedantic >> .make-settings

echo WARN=-Wall -W >> .make-settings

echo OPT=-O2 >> .make-settings

echo MALLOC=jemalloc >> .make-settings

echo CFLAGS= >> .make-settings

echo LDFLAGS= >> .make-settings

echo REDIS_CFLAGS= >> .make-settings

echo REDIS_LDFLAGS= >> .make-settings

echo PREV_FINAL_CFLAGS=-std=c99 -pedantic -Wall -W -O2 -g -ggdb   -I../deps/hiredis -I../deps/linenoise -I../deps/lua/src -DUSE_JEMALLOC -I../deps/jemalloc/include >> .make-settings

echo PREV_FINAL_LDFLAGS=  -g -ggdb -rdynamic >> .make-settings

(cd ../deps && make hiredis linenoise lua jemalloc)

make[2]: Entering directory '/home/pi/redis-2.8.19/deps'

(cd hiredis && make clean) > /dev/null || true

(cd linenoise && make clean) > /dev/null || true

(cd lua && make clean) > /dev/null || true

(cd jemalloc && [ -f Makefile ] && make distclean) > /dev/null || true

(rm -f .make-*)

(echo "" > .make-cflags)

(echo "" > .make-ldflags)

MAKE hiredis

cd hiredis && make static

make[3]: Entering directory '/home/pi/redis-2.8.19/deps/hiredis'

cc -std=c99 -pedantic -c -O3 -fPIC  -Wall -W -Wstrict-prototypes -Wwrite-strings -g -ggdb  net.c

cc -std=c99 -pedantic -c -O3 -fPIC  -Wall -W -Wstrict-prototypes -Wwrite-strings -g -ggdb  hiredis.c

cc -std=c99 -pedantic -c -O3 -fPIC  -Wall -W -Wstrict-prototypes -Wwrite-strings -g -ggdb  sds.c

cc -std=c99 -pedantic -c -O3 -fPIC  -Wall -W -Wstrict-prototypes -Wwrite-strings -g -ggdb  async.c

ar rcs libhiredis.a net.o hiredis.o sds.o async.o

make[3]: Leaving directory '/home/pi/redis-2.8.19/deps/hiredis'

MAKE linenoise

cd linenoise && make

make[3]: Entering directory '/home/pi/redis-2.8.19/deps/linenoise'

cc  -Wall -Os -g  -c linenoise.c

make[3]: Leaving directory '/home/pi/redis-2.8.19/deps/linenoise'

MAKE lua

cd lua/src && make all CFLAGS="-O2 -Wall -DLUA_ANSI -DENABLE_CJSON_GLOBAL " MYLDFLAGS="" AR="ar rcu"

make[3]: Entering directory '/home/pi/redis-2.8.19/deps/lua/src'

cc -O2 -Wall -DLUA_ANSI -DENABLE_CJSON_GLOBAL    -c -o lapi.o lapi.c

cc -O2 -Wall -DLUA_ANSI -DENABLE_CJSON_GLOBAL    -c -o lcode.o lcode.c

cc -O2 -Wall -DLUA_ANSI -DENABLE_CJSON_GLOBAL    -c -o ldebug.o ldebug.c

cc -O2 -Wall -DLUA_ANSI -DENABLE_CJSON_GLOBAL    -c -o ldo.o ldo.c

cc -O2 -Wall -DLUA_ANSI -DENABLE_CJSON_GLOBAL    -c -o ldump.o ldump.c

cc -O2 -Wall -DLUA_ANSI -DENABLE_CJSON_GLOBAL    -c -o lfunc.o lfunc.c

cc -O2 -Wall -DLUA_ANSI -DENABLE_CJSON_GLOBAL    -c -o lgc.o lgc.c

cc -O2 -Wall -DLUA_ANSI -DENABLE_CJSON_GLOBAL    -c -o llex.o llex.c

cc -O2 -Wall -DLUA_ANSI -DENABLE_CJSON_GLOBAL    -c -o lmem.o lmem.c

cc -O2 -Wall -DLUA_ANSI -DENABLE_CJSON_GLOBAL    -c -o lobject.o lobject.c

cc -O2 -Wall -DLUA_ANSI -DENABLE_CJSON_GLOBAL    -c -o lopcodes.o lopcodes.c

cc -O2 -Wall -DLUA_ANSI -DENABLE_CJSON_GLOBAL    -c -o lparser.o lparser.c

cc -O2 -Wall -DLUA_ANSI -DENABLE_CJSON_GLOBAL    -c -o lstate.o lstate.c

cc -O2 -Wall -DLUA_ANSI -DENABLE_CJSON_GLOBAL    -c -o lstring.o lstring.c

cc -O2 -Wall -DLUA_ANSI -DENABLE_CJSON_GLOBAL    -c -o ltable.o ltable.c

cc -O2 -Wall -DLUA_ANSI -DENABLE_CJSON_GLOBAL    -c -o ltm.o ltm.c

cc -O2 -Wall -DLUA_ANSI -DENABLE_CJSON_GLOBAL    -c -o lundump.o lundump.c

cc -O2 -Wall -DLUA_ANSI -DENABLE_CJSON_GLOBAL    -c -o lvm.o lvm.c

cc -O2 -Wall -DLUA_ANSI -DENABLE_CJSON_GLOBAL    -c -o lzio.o lzio.c

cc -O2 -Wall -DLUA_ANSI -DENABLE_CJSON_GLOBAL    -c -o strbuf.o strbuf.c

cc -O2 -Wall -DLUA_ANSI -DENABLE_CJSON_GLOBAL    -c -o fpconv.o fpconv.c

cc -O2 -Wall -DLUA_ANSI -DENABLE_CJSON_GLOBAL    -c -o lauxlib.o lauxlib.c

cc -O2 -Wall -DLUA_ANSI -DENABLE_CJSON_GLOBAL    -c -o lbaselib.o lbaselib.c

cc -O2 -Wall -DLUA_ANSI -DENABLE_CJSON_GLOBAL    -c -o ldblib.o ldblib.c

cc -O2 -Wall -DLUA_ANSI -DENABLE_CJSON_GLOBAL    -c -o liolib.o liolib.c

cc -O2 -Wall -DLUA_ANSI -DENABLE_CJSON_GLOBAL    -c -o lmathlib.o lmathlib.c

cc -O2 -Wall -DLUA_ANSI -DENABLE_CJSON_GLOBAL    -c -o loslib.o loslib.c

cc -O2 -Wall -DLUA_ANSI -DENABLE_CJSON_GLOBAL    -c -o ltablib.o ltablib.c

cc -O2 -Wall -DLUA_ANSI -DENABLE_CJSON_GLOBAL    -c -o lstrlib.o lstrlib.c

cc -O2 -Wall -DLUA_ANSI -DENABLE_CJSON_GLOBAL    -c -o loadlib.o loadlib.c

cc -O2 -Wall -DLUA_ANSI -DENABLE_CJSON_GLOBAL    -c -o linit.o linit.c

cc -O2 -Wall -DLUA_ANSI -DENABLE_CJSON_GLOBAL    -c -o lua_cjson.o lua_cjson.c

cc -O2 -Wall -DLUA_ANSI -DENABLE_CJSON_GLOBAL    -c -o lua_struct.o lua_struct.c

cc -O2 -Wall -DLUA_ANSI -DENABLE_CJSON_GLOBAL    -c -o lua_cmsgpack.o lua_cmsgpack.c

cc -O2 -Wall -DLUA_ANSI -DENABLE_CJSON_GLOBAL    -c -o lua_bit.o lua_bit.c

ar rcu liblua.a lapi.o lcode.o ldebug.o ldo.o ldump.o lfunc.o lgc.o llex.o lmem.o lobject.o lopcodes.o lparser.o lstate.o lstring.o ltable.o ltm.o lundump.o lvm.o lzio.o strbuf.o fpconv.o lauxlib.o lbaselib.o ldblib.o liolib.o lmathlib.o loslib.o ltablib.o lstrlib.o loadlib.o linit.o lua_cjson.o lua_struct.o lua_cmsgpack.o lua_bit.o # DLL needs all object files

ranlib liblua.a

cc -O2 -Wall -DLUA_ANSI -DENABLE_CJSON_GLOBAL    -c -o lua.o lua.c

cc -o lua  lua.o liblua.a -lm 

cc -O2 -Wall -DLUA_ANSI -DENABLE_CJSON_GLOBAL    -c -o luac.o luac.c

cc -O2 -Wall -DLUA_ANSI -DENABLE_CJSON_GLOBAL    -c -o print.o print.c

cc -o luac  luac.o print.o liblua.a -lm 

make[3]: Leaving directory '/home/pi/redis-2.8.19/deps/lua/src'

MAKE jemalloc

cd jemalloc && ./configure --with-jemalloc-prefix=je_ --enable-cc-silence CFLAGS="-std=gnu99 -Wall -pipe -g3 -O3 -funroll-loops " LDFLAGS=""

checking for xsltproc... false

checking for gcc... gcc

checking whether the C compiler works... yes

checking for C compiler default output file name... a.out

checking for suffix of executables... 

checking whether we are cross compiling... no

checking for suffix of object files... o

checking whether we are using the GNU C compiler... yes

checking whether gcc accepts -g... yes

checking for gcc option to accept ISO C89... none needed

checking how to run the C preprocessor... gcc -E

checking for grep that handles long lines and -e... /bin/grep

checking for egrep... /bin/grep -E

checking for ANSI C header files... yes

checking for sys/types.h... yes

checking for sys/stat.h... yes

checking for stdlib.h... yes

checking for string.h... yes

checking for memory.h... yes

checking for strings.h... yes

checking for inttypes.h... yes

checking for stdint.h... yes

checking for unistd.h... yes

checking whether byte ordering is bigendian... no

checking size of void *... 4

checking size of int... 4

checking size of long... 4

checking size of intmax_t... 8

checking build system type... armv7l-unknown-linux-gnueabihf

checking host system type... armv7l-unknown-linux-gnueabihf

checking for ar... ar

checking whether __attribute__ syntax is compilable... yes

checking whether compiler supports -fvisibility=hidden... yes

checking whether compiler supports -Werror... yes

checking whether tls_model attribute is compilable... no

checking for a BSD-compatible install... /usr/bin/install -c

checking for ranlib... ranlib

checking for ld... /usr/bin/ld

checking for autoconf... false

checking for memalign... yes

checking for valloc... yes

checking configured backtracing method... N/A

checking for sbrk... yes

checking whether utrace(2) is compilable... no

checking whether valgrind is compilable... no

checking STATIC_PAGE_SHIFT... 12

checking pthread.h usability... yes

checking pthread.h presence... yes

checking for pthread.h... yes

checking for pthread_create in -lpthread... yes

checking for _malloc_thread_cleanup... no

checking for _pthread_mutex_init_calloc_cb... no

checking for TLS... yes

checking whether a program using ffsl is compilable... yes

checking whether atomic(9) is compilable... no

checking whether Darwin OSAtomic*() is compilable... no

checking whether to force 32-bit __sync_{add,sub}_and_fetch()... no

checking whether to force 64-bit __sync_{add,sub}_and_fetch()... no

checking whether Darwin OSSpin*() is compilable... no

checking for stdbool.h that conforms to C99... yes

checking for _Bool... yes

configure: creating ./config.status

config.status: creating Makefile

config.status: creating doc/html.xsl

config.status: creating doc/manpages.xsl

config.status: creating doc/jemalloc.xml

config.status: creating include/jemalloc/jemalloc_macros.h

config.status: creating include/jemalloc/jemalloc_protos.h

config.status: creating include/jemalloc/internal/jemalloc_internal.h

config.status: creating test/test.sh

config.status: creating test/include/test/jemalloc_test.h

config.status: creating config.stamp

config.status: creating bin/jemalloc.sh

config.status: creating include/jemalloc/jemalloc_defs.h

config.status: creating include/jemalloc/internal/jemalloc_internal_defs.h

config.status: creating test/include/test/jemalloc_test_defs.h

config.status: executing include/jemalloc/internal/private_namespace.h commands

config.status: executing include/jemalloc/internal/private_unnamespace.h commands

config.status: executing include/jemalloc/internal/public_symbols.txt commands

config.status: executing include/jemalloc/internal/public_namespace.h commands

config.status: executing include/jemalloc/internal/public_unnamespace.h commands

config.status: executing include/jemalloc/internal/size_classes.h commands

config.status: executing include/jemalloc/jemalloc_protos_jet.h commands

config.status: executing include/jemalloc/jemalloc_rename.h commands

config.status: executing include/jemalloc/jemalloc_mangle.h commands

config.status: executing include/jemalloc/jemalloc_mangle_jet.h commands

config.status: executing include/jemalloc/jemalloc.h commands

===============================================================================

jemalloc version   : 3.6.0-0-g46c0af68bd248b04df75e4f92d5fb804c3d75340

library revision   : 1


CC                 : gcc

CPPFLAGS           :  -D_GNU_SOURCE -D_REENTRANT

CFLAGS             : -std=gnu99 -Wall -pipe -g3 -O3 -funroll-loops  -fvisibility=hidden

LDFLAGS            : 

EXTRA_LDFLAGS      : 

LIBS               :  -lpthread

RPATH_EXTRA        : 


XSLTPROC           : false

XSLROOT            : 


PREFIX             : /usr/local

BINDIR             : /usr/local/bin

INCLUDEDIR         : /usr/local/include

LIBDIR             : /usr/local/lib

DATADIR            : /usr/local/share

MANDIR             : /usr/local/share/man


srcroot            : 

abs_srcroot        : /home/pi/redis-2.8.19/deps/jemalloc/

objroot            : 

abs_objroot        : /home/pi/redis-2.8.19/deps/jemalloc/


JEMALLOC_PREFIX    : je_

JEMALLOC_PRIVATE_NAMESPACE

                   : je_

install_suffix     : 

autogen            : 0

experimental       : 1

cc-silence         : 1

debug              : 0

code-coverage      : 0

stats              : 1

prof               : 0

prof-libunwind     : 0

prof-libgcc        : 0

prof-gcc           : 0

tcache             : 1

fill               : 1

utrace             : 0

valgrind           : 0

xmalloc            : 0

mremap             : 0

munmap             : 0

dss                : 0

lazy_lock          : 0

tls                : 1

===============================================================================

cd jemalloc && make CFLAGS="-std=gnu99 -Wall -pipe -g3 -O3 -funroll-loops " LDFLAGS="" lib/libjemalloc.a

make[3]: Entering directory '/home/pi/redis-2.8.19/deps/jemalloc'

gcc -std=gnu99 -Wall -pipe -g3 -O3 -funroll-loops  -c -D_GNU_SOURCE -D_REENTRANT -Iinclude -Iinclude -o src/jemalloc.o src/jemalloc.c

gcc -std=gnu99 -Wall -pipe -g3 -O3 -funroll-loops  -c -D_GNU_SOURCE -D_REENTRANT -Iinclude -Iinclude -o src/arena.o src/arena.c

gcc -std=gnu99 -Wall -pipe -g3 -O3 -funroll-loops  -c -D_GNU_SOURCE -D_REENTRANT -Iinclude -Iinclude -o src/atomic.o src/atomic.c

gcc -std=gnu99 -Wall -pipe -g3 -O3 -funroll-loops  -c -D_GNU_SOURCE -D_REENTRANT -Iinclude -Iinclude -o src/base.o src/base.c

gcc -std=gnu99 -Wall -pipe -g3 -O3 -funroll-loops  -c -D_GNU_SOURCE -D_REENTRANT -Iinclude -Iinclude -o src/bitmap.o src/bitmap.c

gcc -std=gnu99 -Wall -pipe -g3 -O3 -funroll-loops  -c -D_GNU_SOURCE -D_REENTRANT -Iinclude -Iinclude -o src/chunk.o src/chunk.c

gcc -std=gnu99 -Wall -pipe -g3 -O3 -funroll-loops  -c -D_GNU_SOURCE -D_REENTRANT -Iinclude -Iinclude -o src/chunk_dss.o src/chunk_dss.c

gcc -std=gnu99 -Wall -pipe -g3 -O3 -funroll-loops  -c -D_GNU_SOURCE -D_REENTRANT -Iinclude -Iinclude -o src/chunk_mmap.o src/chunk_mmap.c

gcc -std=gnu99 -Wall -pipe -g3 -O3 -funroll-loops  -c -D_GNU_SOURCE -D_REENTRANT -Iinclude -Iinclude -o src/ckh.o src/ckh.c

gcc -std=gnu99 -Wall -pipe -g3 -O3 -funroll-loops  -c -D_GNU_SOURCE -D_REENTRANT -Iinclude -Iinclude -o src/ctl.o src/ctl.c

gcc -std=gnu99 -Wall -pipe -g3 -O3 -funroll-loops  -c -D_GNU_SOURCE -D_REENTRANT -Iinclude -Iinclude -o src/extent.o src/extent.c

gcc -std=gnu99 -Wall -pipe -g3 -O3 -funroll-loops  -c -D_GNU_SOURCE -D_REENTRANT -Iinclude -Iinclude -o src/hash.o src/hash.c

gcc -std=gnu99 -Wall -pipe -g3 -O3 -funroll-loops  -c -D_GNU_SOURCE -D_REENTRANT -Iinclude -Iinclude -o src/huge.o src/huge.c

gcc -std=gnu99 -Wall -pipe -g3 -O3 -funroll-loops  -c -D_GNU_SOURCE -D_REENTRANT -Iinclude -Iinclude -o src/mb.o src/mb.c

gcc -std=gnu99 -Wall -pipe -g3 -O3 -funroll-loops  -c -D_GNU_SOURCE -D_REENTRANT -Iinclude -Iinclude -o src/mutex.o src/mutex.c

gcc -std=gnu99 -Wall -pipe -g3 -O3 -funroll-loops  -c -D_GNU_SOURCE -D_REENTRANT -Iinclude -Iinclude -o src/prof.o src/prof.c

gcc -std=gnu99 -Wall -pipe -g3 -O3 -funroll-loops  -c -D_GNU_SOURCE -D_REENTRANT -Iinclude -Iinclude -o src/quarantine.o src/quarantine.c

gcc -std=gnu99 -Wall -pipe -g3 -O3 -funroll-loops  -c -D_GNU_SOURCE -D_REENTRANT -Iinclude -Iinclude -o src/rtree.o src/rtree.c

gcc -std=gnu99 -Wall -pipe -g3 -O3 -funroll-loops  -c -D_GNU_SOURCE -D_REENTRANT -Iinclude -Iinclude -o src/stats.o src/stats.c

gcc -std=gnu99 -Wall -pipe -g3 -O3 -funroll-loops  -c -D_GNU_SOURCE -D_REENTRANT -Iinclude -Iinclude -o src/tcache.o src/tcache.c

gcc -std=gnu99 -Wall -pipe -g3 -O3 -funroll-loops  -c -D_GNU_SOURCE -D_REENTRANT -Iinclude -Iinclude -o src/util.o src/util.c

gcc -std=gnu99 -Wall -pipe -g3 -O3 -funroll-loops  -c -D_GNU_SOURCE -D_REENTRANT -Iinclude -Iinclude -o src/tsd.o src/tsd.c

ar crus lib/libjemalloc.a src/jemalloc.o src/arena.o src/atomic.o src/base.o src/bitmap.o src/chunk.o src/chunk_dss.o src/chunk_mmap.o src/ckh.o src/ctl.o src/extent.o src/hash.o src/huge.o src/mb.o src/mutex.o src/prof.o src/quarantine.o src/rtree.o src/stats.o src/tcache.o src/util.o src/tsd.o

make[3]: Leaving directory '/home/pi/redis-2.8.19/deps/jemalloc'

make[2]: Leaving directory '/home/pi/redis-2.8.19/deps'

    CC adlist.o

    CC ae.o

    CC anet.o

    CC dict.o

    CC redis.o

    CC sds.o

    CC zmalloc.o

    CC lzf_c.o

    CC lzf_d.o

    CC pqsort.o

    CC zipmap.o

    CC sha1.o

    CC ziplist.o

    CC release.o

    CC networking.o

    CC util.o

    CC object.o

    CC db.o

    CC replication.o

    CC rdb.o

    CC t_string.o

    CC t_list.o

    CC t_set.o

    CC t_zset.o

    CC t_hash.o

    CC config.o

    CC aof.o

    CC pubsub.o

    CC multi.o

    CC debug.o

debug.c: In function ‘getMcontextEip’:

debug.c:515:1: warning: no return statement in function returning non-void [-Wreturn-type]

debug.c:486:41: warning: unused parameter ‘uc’ [-Wunused-parameter]

debug.c: In function ‘logRegisters’:

debug.c:530:31: warning: unused parameter ‘uc’ [-Wunused-parameter]

    CC sort.o

    CC intset.o

    CC syncio.o

    CC migrate.o

    CC endianconv.o

    CC slowlog.o

    CC scripting.o

    CC bio.o

    CC rio.o

    CC rand.o

    CC memtest.o

    CC crc64.o

    CC bitops.o

    CC sentinel.o

    CC notify.o

    CC setproctitle.o

    CC hyperloglog.o

    CC latency.o

    CC sparkline.o

    LINK redis-server

    INSTALL redis-sentinel

    CC redis-cli.o

    LINK redis-cli

    CC redis-benchmark.o

    LINK redis-benchmark

    CC redis-check-dump.o

    LINK redis-check-dump

    CC redis-check-aof.o

    LINK redis-check-aof


Hint: It's a good idea to run 'make test' ;)


make[1]: Leaving directory '/home/pi/redis-2.8.19/src'

pi@raspberrypi ~/redis-2.8.19 $ make test

cd src && make test

make[1]: Entering directory '/home/pi/redis-2.8.19/src'

** SLOW COMPUTER ** Using a single client to avoid false positives.

Cleanup: may take some time... OK

Starting test server at port 11111

[ready]: 6773

Testing unit/printver

Testing Redis version 2.8.19 (00000000)

[1/36 done]: unit/printver (0 seconds)

Testing unit/auth

[ok]: AUTH fails if there is no password configured server side

[ok]: AUTH fails when a wrong password is given

[ok]: Arbitrary command gives an error when AUTH is required

[ok]: AUTH succeeds when the right password is given

[ok]: Once AUTH succeeded we can actually send commands to the server

[2/36 done]: unit/auth (1 seconds)

Testing unit/protocol

[ok]: Handle an empty query

[ok]: Negative multibulk length

[ok]: Out of range multibulk length

[ok]: Wrong multibulk payload header

[ok]: Negative multibulk payload length

[ok]: Out of range multibulk payload length

[ok]: Non-number multibulk payload length

[ok]: Multi bulk request not followed by bulk arguments

[ok]: Generic wrong number of args

[ok]: Unbalanced number of quotes

[ok]: Protocol desync regression test #1

[ok]: Protocol desync regression test #2

[ok]: Protocol desync regression test #3

[ok]: Regression for a crash with blocking ops and pipelining

[3/36 done]: unit/protocol (3 seconds)

Testing unit/basic

[ok]: DEL all keys to start with a clean DB

[ok]: SET and GET an item

[ok]: SET and GET an empty item

[ok]: DEL against a single item

[ok]: Vararg DEL

[ok]: KEYS with pattern

[ok]: KEYS to get all keys

[ok]: DBSIZE

[ok]: DEL all keys

[ok]: Very big payload in GET/SET

[ok]: Very big payload random access

[ok]: SET 10000 numeric keys and access all them in reverse order

[ok]: DBSIZE should be 10101 now

[ok]: INCR against non existing key

[ok]: INCR against key created by incr itself

[ok]: INCR against key originally set with SET

[ok]: INCR over 32bit value

[ok]: INCRBY over 32bit value with over 32bit increment

[ok]: INCR fails against key with spaces (left)

[ok]: INCR fails against key with spaces (right)

[ok]: INCR fails against key with spaces (both)

[ok]: INCR fails against a key holding a list

[ok]: DECRBY over 32bit value with over 32bit increment, negative res

[ok]: INCRBYFLOAT against non existing key

[ok]: INCRBYFLOAT against key originally set with SET

[ok]: INCRBYFLOAT over 32bit value

[ok]: INCRBYFLOAT over 32bit value with over 32bit increment

[ok]: INCRBYFLOAT fails against key with spaces (left)

[ok]: INCRBYFLOAT fails against key with spaces (right)

[ok]: INCRBYFLOAT fails against key with spaces (both)

[ok]: INCRBYFLOAT fails against a key holding a list

[ok]: INCRBYFLOAT does not allow NaN or Infinity

[ok]: INCRBYFLOAT decrement

[ok]: SETNX target key missing

[ok]: SETNX target key exists

[ok]: SETNX against not-expired volatile key

[ok]: SETNX against expired volatile key

[ok]: DEL against expired key

[ok]: EXISTS

[ok]: Zero length value in key. SET/GET/EXISTS

[ok]: Commands pipelining

[ok]: Non existing command

[ok]: RENAME basic usage

[ok]: RENAME source key should no longer exist

[ok]: RENAME against already existing key

[ok]: RENAMENX basic usage

[ok]: RENAMENX against already existing key

[ok]: RENAMENX against already existing key (2)

[ok]: RENAME against non existing source key

[ok]: RENAME where source and dest key is the same

[ok]: RENAME with volatile key, should move the TTL as well

[ok]: RENAME with volatile key, should not inherit TTL of target key

[ok]: DEL all keys again (DB 0)

[ok]: DEL all keys again (DB 1)

[ok]: MOVE basic usage

[ok]: MOVE against key existing in the target DB

[ok]: MOVE against non-integer DB (#1428)

[ok]: SET/GET keys in different DBs

[ok]: MGET

[ok]: MGET against non existing key

[ok]: MGET against non-string key

[ok]: RANDOMKEY

[ok]: RANDOMKEY against empty DB

[ok]: RANDOMKEY regression 1

[ok]: GETSET (set new value)

[ok]: GETSET (replace old value)

[ok]: MSET base case

[ok]: MSET wrong number of args

[ok]: MSETNX with already existent key

[ok]: MSETNX with not existing keys

[ok]: STRLEN against non-existing key

[ok]: STRLEN against integer-encoded value

[ok]: STRLEN against plain string

[ok]: SETBIT against non-existing key

[ok]: SETBIT against string-encoded key

[ok]: SETBIT against integer-encoded key

[ok]: SETBIT against key with wrong type

[ok]: SETBIT with out of range bit offset

[ok]: SETBIT with non-bit argument

[ok]: SETBIT fuzzing

[ok]: GETBIT against non-existing key

[ok]: GETBIT against string-encoded key

[ok]: GETBIT against integer-encoded key

[ok]: SETRANGE against non-existing key

[ok]: SETRANGE against string-encoded key

[ok]: SETRANGE against integer-encoded key

[ok]: SETRANGE against key with wrong type

[ok]: SETRANGE with out of range offset

[ok]: GETRANGE against non-existing key

[ok]: GETRANGE against string value

[ok]: GETRANGE against integer-encoded value

[ok]: GETRANGE fuzzing

[ok]: Extended SET can detect syntax errors

[ok]: Extended SET NX option

[ok]: Extended SET XX option

[ok]: Extended SET EX option

[ok]: Extended SET PX option

[ok]: Extended SET using multiple options at once

[ok]: KEYS * two times with long key, Github issue #1208

[ok]: GETRANGE with huge ranges, Github issue #1844

[4/36 done]: unit/basic (55 seconds)

Testing unit/scan

[ok]: SCAN basic

[ok]: SCAN COUNT

[ok]: SCAN MATCH

[ok]: SSCAN with encoding intset

[ok]: SSCAN with encoding hashtable

[ok]: HSCAN with encoding ziplist

[ok]: HSCAN with encoding hashtable

[ok]: ZSCAN with encoding ziplist

[ok]: ZSCAN with encoding skiplist

[ok]: SCAN guarantees check under write load

[ok]: SSCAN with integer encoded object (issue #1345)

[ok]: SSCAN with PATTERN

[ok]: HSCAN with PATTERN

[ok]: ZSCAN with PATTERN

[ok]: ZSCAN scores: regression test for issue #2175

[5/36 done]: unit/scan (2 seconds)

Testing unit/type/list

[ok]: LPUSH, RPUSH, LLENGTH, LINDEX, LPOP - ziplist

[ok]: LPUSH, RPUSH, LLENGTH, LINDEX, LPOP - regular list

[ok]: R/LPOP against empty list

[ok]: Variadic RPUSH/LPUSH

[ok]: DEL a list - ziplist

[ok]: DEL a list - regular list

[ok]: BLPOP, BRPOP: single existing list - linkedlist

[ok]: BLPOP, BRPOP: multiple existing lists - linkedlist

[ok]: BLPOP, BRPOP: second list has an entry - linkedlist

[ok]: BRPOPLPUSH - linkedlist

[ok]: BLPOP, BRPOP: single existing list - ziplist

[ok]: BLPOP, BRPOP: multiple existing lists - ziplist

[ok]: BLPOP, BRPOP: second list has an entry - ziplist

[ok]: BRPOPLPUSH - ziplist

[ok]: BLPOP, LPUSH + DEL should not awake blocked client

[ok]: BLPOP, LPUSH + DEL + SET should not awake blocked client

[ok]: BLPOP with same key multiple times should work (issue #801)

[ok]: MULTI/EXEC is isolated from the point of view of BLPOP

[ok]: BLPOP with variadic LPUSH

[ok]: BRPOPLPUSH with zero timeout should block indefinitely

[ok]: BRPOPLPUSH with a client BLPOPing the target list

[ok]: BRPOPLPUSH with wrong source type

[ok]: BRPOPLPUSH with wrong destination type

[ok]: BRPOPLPUSH maintains order of elements after failure

[ok]: BRPOPLPUSH with multiple blocked clients

[ok]: Linked BRPOPLPUSH

[ok]: Circular BRPOPLPUSH

[ok]: Self-referential BRPOPLPUSH

[ok]: BRPOPLPUSH inside a transaction

[ok]: PUSH resulting from BRPOPLPUSH affect WATCH

[ok]: BRPOPLPUSH does not affect WATCH while still blocked

[ok]: BRPOPLPUSH timeout

[ok]: BLPOP when new key is moved into place

[ok]: BLPOP when result key is created by SORT..STORE

[ok]: BLPOP: with single empty list argument

[ok]: BLPOP: with negative timeout

[ok]: BLPOP: with non-integer timeout

[ok]: BLPOP: with zero timeout should block indefinitely

[ok]: BLPOP: second argument is not a list

[ok]: BLPOP: timeout

[ok]: BLPOP: arguments are empty

[ok]: BRPOP: with single empty list argument

[ok]: BRPOP: with negative timeout

[ok]: BRPOP: with non-integer timeout

[ok]: BRPOP: with zero timeout should block indefinitely

[ok]: BRPOP: second argument is not a list

[ok]: BRPOP: timeout

[ok]: BRPOP: arguments are empty

[ok]: BLPOP inside a transaction

[ok]: LPUSHX, RPUSHX - generic

[ok]: LPUSHX, RPUSHX - linkedlist

[ok]: LINSERT - linkedlist

[ok]: LPUSHX, RPUSHX - ziplist

[ok]: LINSERT - ziplist

[ok]: LINSERT raise error on bad syntax

[ok]: LPUSHX, RPUSHX convert from ziplist to list

[ok]: LINSERT convert from ziplist to list

[ok]: LINDEX consistency test - ziplist

[ok]: LINDEX random access - ziplist

[ok]: Check if list is still ok after a DEBUG RELOAD - ziplist

[ok]: LINDEX consistency test - linkedlist

[ok]: LINDEX random access - linkedlist

[ok]: Check if list is still ok after a DEBUG RELOAD - linkedlist

[ok]: LLEN against non-list value error

[ok]: LLEN against non existing key

[ok]: LINDEX against non-list value error

[ok]: LINDEX against non existing key

[ok]: LPUSH against non-list value error

[ok]: RPUSH against non-list value error

[ok]: RPOPLPUSH base case - linkedlist

[ok]: RPOPLPUSH with the same list as src and dst - linkedlist

[ok]: RPOPLPUSH with linkedlist source and existing target linkedlist

[ok]: RPOPLPUSH with linkedlist source and existing target ziplist

[ok]: RPOPLPUSH base case - ziplist

[ok]: RPOPLPUSH with the same list as src and dst - ziplist

[ok]: RPOPLPUSH with ziplist source and existing target linkedlist

[ok]: RPOPLPUSH with ziplist source and existing target ziplist

[ok]: RPOPLPUSH against non existing key

[ok]: RPOPLPUSH against non list src key

[ok]: RPOPLPUSH against non list dst key

[ok]: RPOPLPUSH against non existing src key

[ok]: Basic LPOP/RPOP - linkedlist

[ok]: Basic LPOP/RPOP - ziplist

[ok]: LPOP/RPOP against non list value

[ok]: Mass RPOP/LPOP - ziplist

[ok]: Mass RPOP/LPOP - linkedlist

[ok]: LRANGE basics - linkedlist

[ok]: LRANGE inverted indexes - linkedlist

[ok]: LRANGE out of range indexes including the full list - linkedlist

[ok]: LRANGE out of range negative end index - linkedlist

[ok]: LRANGE basics - ziplist

[ok]: LRANGE inverted indexes - ziplist

[ok]: LRANGE out of range indexes including the full list - ziplist

[ok]: LRANGE out of range negative end index - ziplist

[ok]: LRANGE against non existing key

[ok]: LTRIM basics - linkedlist

[ok]: LTRIM out of range negative end index - linkedlist

[ok]: LTRIM basics - ziplist

[ok]: LTRIM out of range negative end index - ziplist

[ok]: LSET - linkedlist

[ok]: LSET out of range index - linkedlist

[ok]: LSET - ziplist

[ok]: LSET out of range index - ziplist

[ok]: LSET against non existing key

[ok]: LSET against non list value

[ok]: LREM remove all the occurrences - linkedlist

[ok]: LREM remove the first occurrence - linkedlist

[ok]: LREM remove non existing element - linkedlist

[ok]: LREM starting from tail with negative count - linkedlist

[ok]: LREM starting from tail with negative count (2) - linkedlist

[ok]: LREM deleting objects that may be int encoded - linkedlist

[ok]: LREM remove all the occurrences - ziplist

[ok]: LREM remove the first occurrence - ziplist

[ok]: LREM remove non existing element - ziplist

[ok]: LREM starting from tail with negative count - ziplist

[ok]: LREM starting from tail with negative count (2) - ziplist

[ok]: LREM deleting objects that may be int encoded - ziplist

[ok]: Regression for bug 593 - chaining BRPOPLPUSH with other blocking cmds

[6/36 done]: unit/type/list (16 seconds)

Testing unit/type/list-2

[ok]: LTRIM stress testing - linkedlist

[ok]: LTRIM stress testing - ziplist

[7/36 done]: unit/type/list-2 (22 seconds)

Testing unit/type/list-3

[ok]: Explicit regression for a list bug

[ok]: ziplist implementation: value encoding and backlink

[ok]: ziplist implementation: encoding stress testing

[8/36 done]: unit/type/list-3 (64 seconds)

Testing unit/type/set

[ok]: SADD, SCARD, SISMEMBER, SMEMBERS basics - regular set

[ok]: SADD, SCARD, SISMEMBER, SMEMBERS basics - intset

[ok]: SADD against non set

[ok]: SADD a non-integer against an intset

[ok]: SADD an integer larger than 64 bits

[ok]: SADD overflows the maximum allowed integers in an intset

[ok]: Variadic SADD

[ok]: Set encoding after DEBUG RELOAD

[ok]: SREM basics - regular set

[ok]: SREM basics - intset

[ok]: SREM with multiple arguments

[ok]: SREM variadic version with more args needed to destroy the key

[ok]: Generated sets must be encoded as hashtable

[ok]: SINTER with two sets - hashtable

[ok]: SINTERSTORE with two sets - hashtable

[ok]: SINTERSTORE with two sets, after a DEBUG RELOAD - hashtable

[ok]: SUNION with two sets - hashtable

[ok]: SUNIONSTORE with two sets - hashtable

[ok]: SINTER against three sets - hashtable

[ok]: SINTERSTORE with three sets - hashtable

[ok]: SUNION with non existing keys - hashtable

[ok]: SDIFF with two sets - hashtable

[ok]: SDIFF with three sets - hashtable

[ok]: SDIFFSTORE with three sets - hashtable

[ok]: Generated sets must be encoded as intset

[ok]: SINTER with two sets - intset

[ok]: SINTERSTORE with two sets - intset

[ok]: SINTERSTORE with two sets, after a DEBUG RELOAD - intset

[ok]: SUNION with two sets - intset

[ok]: SUNIONSTORE with two sets - intset

[ok]: SINTER against three sets - intset

[ok]: SINTERSTORE with three sets - intset

[ok]: SUNION with non existing keys - intset

[ok]: SDIFF with two sets - intset

[ok]: SDIFF with three sets - intset

[ok]: SDIFFSTORE with three sets - intset

[ok]: SDIFF with first set empty

[ok]: SDIFF with same set two times

[ok]: SDIFF fuzzing

[ok]: SINTER against non-set should throw error

[ok]: SUNION against non-set should throw error

[ok]: SINTER should handle non existing key as empty

[ok]: SINTER with same integer elements but different encoding

[ok]: SINTERSTORE against non existing keys should delete dstkey

[ok]: SUNIONSTORE against non existing keys should delete dstkey

[ok]: SPOP basics - hashtable

[ok]: SRANDMEMBER - hashtable

[ok]: SPOP basics - intset

[ok]: SRANDMEMBER - intset

[ok]: SRANDMEMBER with <count> against non existing key

[ok]: SRANDMEMBER with <count> - hashtable

[ok]: SRANDMEMBER with <count> - intset

[ok]: SMOVE basics - from regular set to intset

[ok]: SMOVE basics - from intset to regular set

[ok]: SMOVE non existing key

[ok]: SMOVE non existing src set

[ok]: SMOVE from regular set to non existing destination set

[ok]: SMOVE from intset to non existing destination set

[ok]: SMOVE wrong src key type

[ok]: SMOVE wrong dst key type

[ok]: SMOVE with identical source and destination

[ok]: intsets implementation stress testing

[9/36 done]: unit/type/set (38 seconds)

Testing unit/type/zset

[ok]: Check encoding - ziplist

[ok]: ZSET basic ZADD and score update - ziplist

[ok]: ZSET element can't be set to NaN with ZADD - ziplist

[ok]: ZSET element can't be set to NaN with ZINCRBY

[ok]: ZINCRBY calls leading to NaN result in error

[ok]: ZADD - Variadic version base case

[ok]: ZADD - Return value is the number of actually added items

[ok]: ZADD - Variadic version does not add nothing on single parsing err

[ok]: ZADD - Variadic version will raise error on missing arg

[ok]: ZINCRBY does not work variadic even if shares ZADD implementation

[ok]: ZCARD basics - ziplist

[ok]: ZREM removes key after last element is removed

[ok]: ZREM variadic version

[ok]: ZREM variadic version -- remove elements after key deletion

[ok]: ZRANGE basics - ziplist

[ok]: ZREVRANGE basics - ziplist

[ok]: ZRANK/ZREVRANK basics - ziplist

[ok]: ZRANK - after deletion - ziplist

[ok]: ZINCRBY - can create a new sorted set - ziplist

[ok]: ZINCRBY - increment and decrement - ziplist

[ok]: ZRANGEBYSCORE/ZREVRANGEBYSCORE/ZCOUNT basics

[ok]: ZRANGEBYSCORE with WITHSCORES

[ok]: ZRANGEBYSCORE with LIMIT

[ok]: ZRANGEBYSCORE with LIMIT and WITHSCORES

[ok]: ZRANGEBYSCORE with non-value min or max

[ok]: ZRANGEBYLEX/ZREVRANGEBYLEX/ZCOUNT basics

[ok]: ZRANGEBYSLEX with LIMIT

[ok]: ZRANGEBYLEX with invalid lex range specifiers

[ok]: ZREMRANGEBYSCORE basics

[ok]: ZREMRANGEBYSCORE with non-value min or max

[ok]: ZREMRANGEBYRANK basics

[ok]: ZUNIONSTORE against non-existing key doesn't set destination - ziplist

[ok]: ZUNIONSTORE with empty set - ziplist

[ok]: ZUNIONSTORE basics - ziplist

[ok]: ZUNIONSTORE with weights - ziplist

[ok]: ZUNIONSTORE with a regular set and weights - ziplist

[ok]: ZUNIONSTORE with AGGREGATE MIN - ziplist

[ok]: ZUNIONSTORE with AGGREGATE MAX - ziplist

[ok]: ZINTERSTORE basics - ziplist

[ok]: ZINTERSTORE with weights - ziplist

[ok]: ZINTERSTORE with a regular set and weights - ziplist

[ok]: ZINTERSTORE with AGGREGATE MIN - ziplist

[ok]: ZINTERSTORE with AGGREGATE MAX - ziplist

[ok]: ZUNIONSTORE with +inf/-inf scores - ziplist

[ok]: ZUNIONSTORE with NaN weights ziplist

[ok]: ZINTERSTORE with +inf/-inf scores - ziplist

[ok]: ZINTERSTORE with NaN weights ziplist

[ok]: Check encoding - skiplist

[ok]: ZSET basic ZADD and score update - skiplist

[ok]: ZSET element can't be set to NaN with ZADD - skiplist

[ok]: ZSET element can't be set to NaN with ZINCRBY

[ok]: ZINCRBY calls leading to NaN result in error

[ok]: ZADD - Variadic version base case

[ok]: ZADD - Return value is the number of actually added items

[ok]: ZADD - Variadic version does not add nothing on single parsing err

[ok]: ZADD - Variadic version will raise error on missing arg

[ok]: ZINCRBY does not work variadic even if shares ZADD implementation

[ok]: ZCARD basics - skiplist

[ok]: ZREM removes key after last element is removed

[ok]: ZREM variadic version

[ok]: ZREM variadic version -- remove elements after key deletion

[ok]: ZRANGE basics - skiplist

[ok]: ZREVRANGE basics - skiplist

[ok]: ZRANK/ZREVRANK basics - skiplist

[ok]: ZRANK - after deletion - skiplist

[ok]: ZINCRBY - can create a new sorted set - skiplist

[ok]: ZINCRBY - increment and decrement - skiplist

[ok]: ZRANGEBYSCORE/ZREVRANGEBYSCORE/ZCOUNT basics

[ok]: ZRANGEBYSCORE with WITHSCORES

[ok]: ZRANGEBYSCORE with LIMIT

[ok]: ZRANGEBYSCORE with LIMIT and WITHSCORES

[ok]: ZRANGEBYSCORE with non-value min or max

[ok]: ZRANGEBYLEX/ZREVRANGEBYLEX/ZCOUNT basics

[ok]: ZRANGEBYSLEX with LIMIT

[ok]: ZRANGEBYLEX with invalid lex range specifiers

[ok]: ZREMRANGEBYSCORE basics

[ok]: ZREMRANGEBYSCORE with non-value min or max

[ok]: ZREMRANGEBYRANK basics

[ok]: ZUNIONSTORE against non-existing key doesn't set destination - skiplist

[ok]: ZUNIONSTORE with empty set - skiplist

[ok]: ZUNIONSTORE basics - skiplist

[ok]: ZUNIONSTORE with weights - skiplist

[ok]: ZUNIONSTORE with a regular set and weights - skiplist

[ok]: ZUNIONSTORE with AGGREGATE MIN - skiplist

[ok]: ZUNIONSTORE with AGGREGATE MAX - skiplist

[ok]: ZINTERSTORE basics - skiplist

[ok]: ZINTERSTORE with weights - skiplist

[ok]: ZINTERSTORE with a regular set and weights - skiplist

[ok]: ZINTERSTORE with AGGREGATE MIN - skiplist

[ok]: ZINTERSTORE with AGGREGATE MAX - skiplist

[ok]: ZUNIONSTORE with +inf/-inf scores - skiplist

[ok]: ZUNIONSTORE with NaN weights skiplist

[ok]: ZINTERSTORE with +inf/-inf scores - skiplist

[ok]: ZINTERSTORE with NaN weights skiplist

[ok]: ZINTERSTORE regression with two sets, intset+hashtable

[ok]: ZUNIONSTORE regression, should not create NaN in scores

[ok]: ZINTERSTORE #516 regression, mixed sets and ziplist zsets

[ok]: ZUNIONSTORE result is sorted

[ok]: ZSCORE - ziplist

[ok]: ZSCORE after a DEBUG RELOAD - ziplist

[ok]: ZSET sorting stresser - ziplist

[ok]: ZRANGEBYSCORE fuzzy test, 100 ranges in 128 element sorted set - ziplist

[ok]: ZRANGEBYLEX fuzzy test, 100 ranges in 128 element sorted set - ziplist

[ok]: ZREMRANGEBYLEX fuzzy test, 100 ranges in 128 element sorted set - ziplist

[ok]: ZSETs skiplist implementation backlink consistency test - ziplist

[ok]: ZSETs ZRANK augmented skip list stress testing - ziplist

[ok]: ZSCORE - skiplist

[ok]: ZSCORE after a DEBUG RELOAD - skiplist

[ok]: ZSET sorting stresser - skiplist

[ok]: ZRANGEBYSCORE fuzzy test, 100 ranges in 100 element sorted set - skiplist

[ok]: ZRANGEBYLEX fuzzy test, 100 ranges in 100 element sorted set - skiplist

[ok]: ZREMRANGEBYLEX fuzzy test, 100 ranges in 100 element sorted set - skiplist

[ok]: ZSETs skiplist implementation backlink consistency test - skiplist

[ok]: ZSETs ZRANK augmented skip list stress testing - skiplist

[10/36 done]: unit/type/zset (43 seconds)

Testing unit/type/hash

[ok]: HSET/HLEN - Small hash creation

[ok]: Is the small hash encoded with a ziplist?

[ok]: HSET/HLEN - Big hash creation

[ok]: Is the big hash encoded with a ziplist?

[ok]: HGET against the small hash

[ok]: HGET against the big hash

[ok]: HGET against non existing key

[ok]: HSET in update and insert mode

[ok]: HSETNX target key missing - small hash

[ok]: HSETNX target key exists - small hash

[ok]: HSETNX target key missing - big hash

[ok]: HSETNX target key exists - big hash

[ok]: HMSET wrong number of args

[ok]: HMSET - small hash

[ok]: HMSET - big hash

[ok]: HMGET against non existing key and fields

[ok]: HMGET against wrong type

[ok]: HMGET - small hash

[ok]: HMGET - big hash

[ok]: HKEYS - small hash

[ok]: HKEYS - big hash

[ok]: HVALS - small hash

[ok]: HVALS - big hash

[ok]: HGETALL - small hash

[ok]: HGETALL - big hash

[ok]: HDEL and return value

[ok]: HDEL - more than a single value

[ok]: HDEL - hash becomes empty before deleting all specified fields

[ok]: HEXISTS

[ok]: Is a ziplist encoded Hash promoted on big payload?

[ok]: HINCRBY against non existing database key

[ok]: HINCRBY against non existing hash key

[ok]: HINCRBY against hash key created by hincrby itself

[ok]: HINCRBY against hash key originally set with HSET

[ok]: HINCRBY over 32bit value

[ok]: HINCRBY over 32bit value with over 32bit increment

[ok]: HINCRBY fails against hash value with spaces (left)

[ok]: HINCRBY fails against hash value with spaces (right)

[ok]: HINCRBY can detect overflows

[ok]: HINCRBYFLOAT against non existing database key

[ok]: HINCRBYFLOAT against non existing hash key

[ok]: HINCRBYFLOAT against hash key created by hincrby itself

[ok]: HINCRBYFLOAT against hash key originally set with HSET

[ok]: HINCRBYFLOAT over 32bit value

[ok]: HINCRBYFLOAT over 32bit value with over 32bit increment

[ok]: HINCRBYFLOAT fails against hash value with spaces (left)

[ok]: HINCRBYFLOAT fails against hash value with spaces (right)

[ok]: Hash ziplist regression test for large keys

[ok]: Hash fuzzing #1 - 10 fields

[ok]: Hash fuzzing #2 - 10 fields

[ok]: Hash fuzzing #1 - 512 fields

[ok]: Hash fuzzing #2 - 512 fields

[ok]: Stress test the hash ziplist -> hashtable encoding conversion

[11/36 done]: unit/type/hash (27 seconds)

Testing unit/sort

[ok]: Ziplist: SORT BY key

[ok]: Ziplist: SORT BY key with limit

[ok]: Ziplist: SORT BY hash field

[ok]: Linked list: SORT BY key

[ok]: Linked list: SORT BY key with limit

[ok]: Linked list: SORT BY hash field

[ok]: Big Linked list: SORT BY key

[ok]: Big Linked list: SORT BY key with limit

[ok]: Big Linked list: SORT BY hash field

[ok]: Intset: SORT BY key

[ok]: Intset: SORT BY key with limit

[ok]: Intset: SORT BY hash field

[ok]: Hash table: SORT BY key

[ok]: Hash table: SORT BY key with limit

[ok]: Hash table: SORT BY hash field

[ok]: Big Hash table: SORT BY key

[ok]: Big Hash table: SORT BY key with limit

[ok]: Big Hash table: SORT BY hash field

[ok]: SORT GET #

[ok]: SORT GET <const>

[ok]: SORT GET (key and hash) with sanity check

[ok]: SORT BY key STORE

[ok]: SORT BY hash field STORE

[ok]: SORT DESC

[ok]: SORT ALPHA against integer encoded strings

[ok]: SORT sorted set

[ok]: SORT sorted set BY nosort should retain ordering

[ok]: SORT sorted set BY nosort + LIMIT

[ok]: SORT sorted set BY nosort works as expected from scripts

[ok]: SORT sorted set: +inf and -inf handling

[ok]: SORT regression for issue #19, sorting floats

[ok]: SORT with STORE returns zero if result is empty (github issue 224)

[ok]: SORT with STORE does not create empty lists (github issue 224)

[ok]: SORT with STORE removes key if result is empty (github issue 227)

[ok]: SORT with BY <constant> and STORE should still order output

[ok]: SORT will complain with numerical sorting and bad doubles (1)

[ok]: SORT will complain with numerical sorting and bad doubles (2)

[ok]: SORT BY sub-sorts lexicographically if score is the same

[ok]: SORT GET with pattern ending with just -> does not get hash field

[ok]: SORT by nosort retains native order for lists

[ok]: SORT by nosort plus store retains native order for lists

[ok]: SORT by nosort with limit returns based on original list order

[ok]: SORT speed, 100 element list BY key, 100 times

[ok]: SORT speed, 100 element list BY hash field, 100 times

[ok]: SORT speed, 100 element list directly, 100 times

[ok]: SORT speed, 100 element list BY <const>, 100 times

[12/36 done]: unit/sort (51 seconds)

Testing unit/expire

[ok]: EXPIRE - set timeouts multiple times

[ok]: EXPIRE - It should be still possible to read 'x'

[ok]: EXPIRE - After 2.1 seconds the key should no longer be here

[ok]: EXPIRE - write on expire should work

[ok]: EXPIREAT - Check for EXPIRE alike behavior

[ok]: SETEX - Set + Expire combo operation. Check for TTL

[ok]: SETEX - Check value

[ok]: SETEX - Overwrite old key

[ok]: SETEX - Wait for the key to expire

[ok]: SETEX - Wrong time parameter

[ok]: PERSIST can undo an EXPIRE

[ok]: PERSIST returns 0 against non existing or non volatile keys

[ok]: EXPIRE pricision is now the millisecond

[ok]: PEXPIRE/PSETEX/PEXPIREAT can set sub-second expires

[ok]: TTL returns tiem to live in seconds

[ok]: PTTL returns time to live in milliseconds

[ok]: TTL / PTTL return -1 if key has no expire

[ok]: TTL / PTTL return -2 if key does not exit

[ok]: Redis should actively expire keys incrementally

[ok]: Redis should lazy expire keys

[ok]: EXPIRE should not resurrect keys (issue #1026)

[ok]: 5 keys in, 5 keys out

[13/36 done]: unit/expire (11 seconds)

Testing unit/other

[ok]: SAVE - make sure there are all the types as values

[ok]: FUZZ stresser with data model binary

[ok]: FUZZ stresser with data model alpha

[ok]: FUZZ stresser with data model compr

[ok]: BGSAVE

[ok]: SELECT an out of range DB

[ok]: EXPIRES after a reload (snapshot + append only file rewrite)

[ok]: EXPIRES after AOF reload (without rewrite)

[ok]: PIPELINING stresser (also a regression for the old epoll bug)

[ok]: APPEND basics

[ok]: APPEND basics, integer encoded values

[ok]: APPEND fuzzing

[ok]: FLUSHDB

[ok]: Perform a final SAVE to leave a clean DB on disk

[14/36 done]: unit/other (29 seconds)

Testing unit/multi

[ok]: MUTLI / EXEC basics

[ok]: DISCARD

[ok]: Nested MULTI are not allowed

[ok]: MULTI where commands alter argc/argv

[ok]: WATCH inside MULTI is not allowed

[ok]: EXEC fails if there are errors while queueing commands #1

[ok]: EXEC fails if there are errors while queueing commands #2

[ok]: If EXEC aborts, the client MULTI state is cleared

[ok]: EXEC works on WATCHed key not modified

[ok]: EXEC fail on WATCHed key modified (1 key of 1 watched)

[ok]: EXEC fail on WATCHed key modified (1 key of 5 watched)

[ok]: EXEC fail on WATCHed key modified by SORT with STORE even if the result is empty

[ok]: After successful EXEC key is no longer watched

[ok]: After failed EXEC key is no longer watched

[ok]: It is possible to UNWATCH

[ok]: UNWATCH when there is nothing watched works as expected

[ok]: FLUSHALL is able to touch the watched keys

[ok]: FLUSHALL does not touch non affected keys

[ok]: FLUSHDB is able to touch the watched keys

[ok]: FLUSHDB does not touch non affected keys

[ok]: WATCH is able to remember the DB a key belongs to

[ok]: WATCH will consider touched keys target of EXPIRE

[ok]: WATCH will not consider touched expired keys

[ok]: DISCARD should clear the WATCH dirty flag on the client

[ok]: DISCARD should UNWATCH all the keys

[ok]: MULTI / EXEC is propagated correctly (single write command)

[ok]: MULTI / EXEC is propagated correctly (empty transaction)

[ok]: MULTI / EXEC is propagated correctly (read-only commands)

[ok]: MULTI / EXEC is propagated correctly (write command, no effect)

[15/36 done]: unit/multi (2 seconds)

Testing unit/quit

[ok]: QUIT returns OK

[ok]: Pipelined commands after QUIT must not be executed

[ok]: Pipelined commands after QUIT that exceed read buffer size

[16/36 done]: unit/quit (1 seconds)

Testing unit/aofrw

[ok]: AOF rewrite during write load

[ok]: Turning off AOF kills the background writing child if any

[ok]: AOF rewrite of list with ziplist encoding, string data

[ok]: AOF rewrite of list with linkedlist encoding, string data

[ok]: AOF rewrite of list with ziplist encoding, int data

[ok]: AOF rewrite of list with linkedlist encoding, int data

[ok]: AOF rewrite of set with intset encoding, string data

[ok]: AOF rewrite of set with hashtable encoding, string data

[ok]: AOF rewrite of set with intset encoding, int data

[ok]: AOF rewrite of set with hashtable encoding, int data

[ok]: AOF rewrite of hash with ziplist encoding, string data

[ok]: AOF rewrite of hash with hashtable encoding, string data

[ok]: AOF rewrite of hash with ziplist encoding, int data

[ok]: AOF rewrite of hash with hashtable encoding, int data

[ok]: AOF rewrite of zset with ziplist encoding, string data

[ok]: AOF rewrite of zset with skiplist encoding, string data

[ok]: AOF rewrite of zset with ziplist encoding, int data

[ok]: AOF rewrite of zset with skiplist encoding, int data

[ok]: BGREWRITEAOF is delayed if BGSAVE is in progress

[ok]: BGREWRITEAOF is refused if already in progress

[17/36 done]: unit/aofrw (42 seconds)

Testing integration/replication

[ok]: First server should have role slave after SLAVEOF

[ok]: BRPOPLPUSH replication, when blocking against empty list

[ok]: BRPOPLPUSH replication, list exists

[ok]: Second server should have role master at first

[ok]: SLAVEOF should start with link status "down"

[ok]: The role should immediately be changed to "slave"

[ok]: Sync should have transferred keys from master

[ok]: The link status should be up

[ok]: SET on the master should immediately propagate

[ok]: FLUSHALL should replicate

[ok]: ROLE in master reports master with a slave

[ok]: ROLE in slave reports slave in connected state

[ok]: Connect multiple slaves at the same time (issue #141), diskless=no

[ok]: Connect multiple slaves at the same time (issue #141), diskless=yes

[18/36 done]: integration/replication (121 seconds)

Testing integration/replication-2

[ok]: First server should have role slave after SLAVEOF

[ok]: If min-slaves-to-write is honored, write is accepted

[ok]: No write if min-slaves-to-write is < attached slaves

[ok]: If min-slaves-to-write is honored, write is accepted (again)

[ok]: No write if min-slaves-max-lag is > of the slave lag

[ok]: min-slaves-to-write is ignored by slaves

[ok]: MASTER and SLAVE dataset should be identical after complex ops

[19/36 done]: integration/replication-2 (50 seconds)

Testing integration/replication-3

[ok]: First server should have role slave after SLAVEOF

[ok]: MASTER and SLAVE consistency with expire

[ok]: First server should have role slave after SLAVEOF

[ok]: MASTER and SLAVE consistency with EVALSHA replication

[20/36 done]: integration/replication-3 (97 seconds)

Testing integration/replication-4

[ok]: First server should have role slave after SLAVEOF

[ok]: Test replication with parallel clients writing in differnet DBs

[ok]: First server should have role slave after SLAVEOF

[ok]: With min-slaves-to-write (1,3): master should be writable

[ok]: With min-slaves-to-write (2,3): master should not be writable

[ok]: With min-slaves-to-write: master not writable with lagged slave

[ok]: First server should have role slave after SLAVEOF

[ok]: Replication: commands with many arguments (issue #1221)

[21/36 done]: integration/replication-4 (136 seconds)

Testing integration/replication-psync

[ok]: Slave should be able to synchronize with the master

[ok]: Detect write load to master

[ok]: Test replication partial resync: ok psync

[ok]: Slave should be able to synchronize with the master

[ok]: Detect write load to master

[ok]: Test replication partial resync: no backlog

[ok]: Slave should be able to synchronize with the master

[ok]: Detect write load to master

[ok]: Test replication partial resync: ok after delay

[ok]: Slave should be able to synchronize with the master

[ok]: Detect write load to master

[ok]: Test replication partial resync: backlog expired

[22/36 done]: integration/replication-psync (46 seconds)

Testing integration/aof

[ok]: Unfinished MULTI: Server should start if load-truncated is yes

[ok]: Short read: Server should start if load-truncated is yes

[ok]: Truncated AOF loaded: we expect foo to be equal to 5

[ok]: Append a new command after loading an incomplete AOF

[ok]: Short read + command: Server should start

[ok]: Truncated AOF loaded: we expect foo to be equal to 6 now

[ok]: Bad format: Server should have logged an error

[ok]: Unfinished MULTI: Server should have logged an error

[ok]: Short read: Server should have logged an error

[ok]: Short read: Utility should confirm the AOF is not valid

[ok]: Short read: Utility should be able to fix the AOF

[ok]: Fixed AOF: Server should have been started

[ok]: Fixed AOF: Keyspace should contain values that were parseable

[ok]: AOF+SPOP: Server should have been started

[ok]: AOF+SPOP: Set should have 1 member

[ok]: AOF+EXPIRE: Server should have been started

[ok]: AOF+EXPIRE: List should be empty

[ok]: Redis should not try to convert DEL into EXPIREAT for EXPIRE -1

[23/36 done]: integration/aof (5 seconds)

Testing integration/rdb

[ok]: RDB encoding loading test

[ok]: Server started empty with non-existing RDB file

[ok]: Server started empty with empty RDB file

[ok]: Server should not start if RDB file can't be open

[ok]: Server should not start if RDB is corrupted

[24/36 done]: integration/rdb (2 seconds)

Testing integration/convert-zipmap-hash-on-load

[ok]: RDB load zipmap hash: converts to ziplist

[ok]: RDB load zipmap hash: converts to hash table when hash-max-ziplist-entries is exceeded

[ok]: RDB load zipmap hash: converts to hash table when hash-max-ziplist-value is exceeded

[25/36 done]: integration/convert-zipmap-hash-on-load (1 seconds)

Testing unit/pubsub

[ok]: Pub/Sub PING

[ok]: PUBLISH/SUBSCRIBE basics

[ok]: PUBLISH/SUBSCRIBE with two clients

[ok]: PUBLISH/SUBSCRIBE after UNSUBSCRIBE without arguments

[ok]: SUBSCRIBE to one channel more than once

[ok]: UNSUBSCRIBE from non-subscribed channels

[ok]: PUBLISH/PSUBSCRIBE basics

[ok]: PUBLISH/PSUBSCRIBE with two clients

[ok]: PUBLISH/PSUBSCRIBE after PUNSUBSCRIBE without arguments

[ok]: PUNSUBSCRIBE from non-subscribed channels

[ok]: NUMSUB returns numbers, not strings (#1561)

[ok]: Mix SUBSCRIBE and PSUBSCRIBE

[ok]: PUNSUBSCRIBE and UNSUBSCRIBE should always reply

[ok]: Keyspace notifications: we receive keyspace notifications

[ok]: Keyspace notifications: we receive keyevent notifications

[ok]: Keyspace notifications: we can receive both kind of events

[ok]: Keyspace notifications: we are able to mask events

[ok]: Keyspace notifications: general events test

[ok]: Keyspace notifications: list events test

[ok]: Keyspace notifications: set events test

[ok]: Keyspace notifications: zset events test

[ok]: Keyspace notifications: hash events test

[ok]: Keyspace notifications: expired events (triggered expire)

[ok]: Keyspace notifications: expired events (background expire)

[ok]: Keyspace notifications: evicted events

[ok]: Keyspace notifications: test CONFIG GET/SET of event flags

[26/36 done]: unit/pubsub (1 seconds)

Testing unit/slowlog

[ok]: SLOWLOG - check that it starts with an empty log

[ok]: SLOWLOG - only logs commands taking more time than specified

[ok]: SLOWLOG - max entries is correctly handled

[ok]: SLOWLOG - GET optional argument to limit output len works

[ok]: SLOWLOG - RESET subcommand works

[ok]: SLOWLOG - logged entry sanity check

[ok]: SLOWLOG - commands with too many arguments are trimmed

[ok]: SLOWLOG - too long arguments are trimmed

[ok]: SLOWLOG - EXEC is not logged, just executed commands

[27/36 done]: unit/slowlog (1 seconds)

Testing unit/scripting

[ok]: EVAL - Does Lua interpreter replies to our requests?

[ok]: EVAL - Lua integer -> Redis protocol type conversion

[ok]: EVAL - Lua string -> Redis protocol type conversion

[ok]: EVAL - Lua true boolean -> Redis protocol type conversion

[ok]: EVAL - Lua false boolean -> Redis protocol type conversion

[ok]: EVAL - Lua status code reply -> Redis protocol type conversion

[ok]: EVAL - Lua error reply -> Redis protocol type conversion

[ok]: EVAL - Lua table -> Redis protocol type conversion

[ok]: EVAL - Are the KEYS and ARGV arrays populated correctly?

[ok]: EVAL - is Lua able to call Redis API?

[ok]: EVALSHA - Can we call a SHA1 if already defined?

[ok]: EVALSHA - Can we call a SHA1 in uppercase?

[ok]: EVALSHA - Do we get an error on invalid SHA1?

[ok]: EVALSHA - Do we get an error on non defined SHA1?

[ok]: EVAL - Redis integer -> Lua type conversion

[ok]: EVAL - Redis bulk -> Lua type conversion

[ok]: EVAL - Redis multi bulk -> Lua type conversion

[ok]: EVAL - Redis status reply -> Lua type conversion

[ok]: EVAL - Redis error reply -> Lua type conversion

[ok]: EVAL - Redis nil bulk reply -> Lua type conversion

[ok]: EVAL - Is the Lua client using the currently selected DB?

[ok]: EVAL - SELECT inside Lua should not affect the caller

[ok]: EVAL - Scripts can't run certain commands

[ok]: EVAL - Scripts can't run certain commands

[ok]: EVAL - No arguments to redis.call/pcall is considered an error

[ok]: EVAL - redis.call variant raises a Lua error on Redis cmd error (1)

[ok]: EVAL - redis.call variant raises a Lua error on Redis cmd error (1)

[ok]: EVAL - redis.call variant raises a Lua error on Redis cmd error (1)

[ok]: EVAL - JSON numeric decoding

[ok]: EVAL - JSON string decoding

[ok]: EVAL - cmsgpack can pack double?

[ok]: EVAL - cmsgpack can pack negative int64?

[ok]: EVAL - cmsgpack can pack and unpack circular references?

[ok]: EVAL - Numerical sanity check from bitop

[ok]: EVAL - Verify minimal bitop functionality

[ok]: SCRIPTING FLUSH - is able to clear the scripts cache?

[ok]: SCRIPT EXISTS - can detect already defined scripts?

[ok]: SCRIPT LOAD - is able to register scripts in the scripting cache

[ok]: In the context of Lua the output of random commands gets ordered

[ok]: SORT is normally not alpha re-ordered for the scripting engine

[ok]: SORT BY <constant> output gets ordered for scripting

[ok]: SORT BY <constant> with GET gets ordered for scripting

[ok]: redis.sha1hex() implementation

[ok]: Globals protection reading an undeclared global variable

[ok]: Globals protection setting an undeclared global*

[ok]: Test an example script DECR_IF_GT

[ok]: Scripting engine resets PRNG at every script execution

[ok]: Scripting engine PRNG can be seeded correctly

[ok]: EVAL does not leak in the Lua stack

[ok]: EVAL processes writes from AOF in read-only slaves

[ok]: We can call scripts rewriting client->argv from Lua

[ok]: Call Redis command with many args from Lua (issue #1764)

[ok]: Number conversion precision test (issue #1118)

[ok]: String containing number precision test (regression of issue #1118)

[ok]: Verify negative arg count is error instead of crash (issue #1842)

[ok]: Correct handling of reused argv (issue #1939)

[ok]: Timedout read-only scripts can be killed by SCRIPT KILL

[ok]: Timedout script link is still usable after Lua returns

[ok]: Timedout scripts that modified data can't be killed by SCRIPT KILL

[ok]: SHUTDOWN NOSAVE can kill a timedout script anyway

[ok]: Before the slave connects we issue two EVAL commands

[ok]: Connect a slave to the main instance

[ok]: Now use EVALSHA against the master, with both SHAs

[ok]: If EVALSHA was replicated as EVAL, 'x' should be '4'

[ok]: Replication of script multiple pushes to list with BLPOP

[ok]: EVALSHA replication when first call is readonly

[ok]: Lua scripts using SELECT are replicated correctly

[28/36 done]: unit/scripting (6 seconds)

Testing unit/maxmemory

[ok]: Without maxmemory small integers are shared

[ok]: With maxmemory and non-LRU policy integers are still shared

[ok]: With maxmemory and LRU policy integers are not shared

[ok]: maxmemory - is the memory limit honoured? (policy allkeys-random)

[ok]: maxmemory - is the memory limit honoured? (policy allkeys-lru)

[ok]: maxmemory - is the memory limit honoured? (policy volatile-lru)

[ok]: maxmemory - is the memory limit honoured? (policy volatile-random)

[ok]: maxmemory - is the memory limit honoured? (policy volatile-ttl)

[ok]: maxmemory - only allkeys-* should remove non-volatile keys (allkeys-random)

[ok]: maxmemory - only allkeys-* should remove non-volatile keys (allkeys-lru)

[ok]: maxmemory - only allkeys-* should remove non-volatile keys (volatile-lru)

[ok]: maxmemory - only allkeys-* should remove non-volatile keys (volatile-random)

[ok]: maxmemory - only allkeys-* should remove non-volatile keys (volatile-ttl)

[ok]: maxmemory - policy volatile-lru should only remove volatile keys.

[ok]: maxmemory - policy volatile-random should only remove volatile keys.

[ok]: maxmemory - policy volatile-ttl should only remove volatile keys.

[29/36 done]: unit/maxmemory (28 seconds)

Testing unit/introspection

[ok]: CLIENT LIST

[ok]: MONITOR can log executed commands

[ok]: MONITOR can log commands issued by the scripting engine

[ok]: CLIENT GETNAME should return NIL if name is not assigned

[ok]: CLIENT LIST shows empty fields for unassigned names

[ok]: CLIENT SETNAME does not accept spaces

[ok]: CLIENT SETNAME can assign a name to this connection

[ok]: CLIENT SETNAME can change the name of an existing connection

[ok]: After CLIENT SETNAME, connection can still be closed

[30/36 done]: unit/introspection (0 seconds)

Testing unit/limits

[ok]: Check if maxclients works refusing connections

[31/36 done]: unit/limits (2 seconds)

Testing unit/obuf-limits

[ok]: Client output buffer hard limit is enforced

[ok]: Client output buffer soft limit is not enforced if time is not overreached

[ok]: Client output buffer soft limit is enforced if time is overreached

[32/36 done]: unit/obuf-limits (222 seconds)

Testing unit/dump

[ok]: DUMP / RESTORE are able to serialize / unserialize a simple key

[ok]: RESTORE can set an arbitrary expire to the materialized key

[ok]: RESTORE can set an expire that overflows a 32 bit integer

[ok]: RESTORE returns an error of the key already exists

[ok]: DUMP of non existing key returns nil

[ok]: MIGRATE is able to migrate a key between two instances

[ok]: MIGRATE propagates TTL correctly

[ok]: MIGRATE can correctly transfer large values

[ok]: MIGRATE can correctly transfer hashes

[ok]: MIGRATE timeout actually works

[33/36 done]: unit/dump (8 seconds)

Testing unit/bitops

[ok]: BITCOUNT returns 0 against non existing key

[ok]: BITCOUNT against test vector #1

[ok]: BITCOUNT against test vector #2

[ok]: BITCOUNT against test vector #3

[ok]: BITCOUNT against test vector #4

[ok]: BITCOUNT against test vector #5

[ok]: BITCOUNT fuzzing without start/end

[ok]: BITCOUNT fuzzing with start/end

[ok]: BITCOUNT with start, end

[ok]: BITCOUNT syntax error #1

[ok]: BITCOUNT regression test for github issue #582

[ok]: BITCOUNT misaligned prefix

[ok]: BITCOUNT misaligned prefix + full words + remainder

[ok]: BITOP NOT (empty string)

[ok]: BITOP NOT (known string)

[ok]: BITOP where dest and target are the same key

[ok]: BITOP AND|OR|XOR don't change the string with single input key

[ok]: BITOP missing key is considered a stream of zero

[ok]: BITOP shorter keys are zero-padded to the key with max length

[ok]: BITOP and fuzzing

[ok]: BITOP or fuzzing

[ok]: BITOP xor fuzzing

[ok]: BITOP NOT fuzzing

[ok]: BITOP with integer encoded source objects

[ok]: BITOP with non string source key

[ok]: BITOP with empty string after non empty string (issue #529)

[ok]: BITPOS bit=0 with empty key returns 0

[ok]: BITPOS bit=1 with empty key returns -1

[ok]: BITPOS bit=0 with string less than 1 word works

[ok]: BITPOS bit=1 with string less than 1 word works

[ok]: BITPOS bit=0 starting at unaligned address

[ok]: BITPOS bit=1 starting at unaligned address

[ok]: BITPOS bit=0 unaligned+full word+reminder

[ok]: BITPOS bit=1 unaligned+full word+reminder

[ok]: BITPOS bit=1 returns -1 if string is all 0 bits

[ok]: BITPOS bit=0 works with intervals

[ok]: BITPOS bit=1 works with intervals

[ok]: BITPOS bit=0 changes behavior if end is given

[ok]: BITPOS bit=1 fuzzy testing using SETBIT

[ok]: BITPOS bit=0 fuzzy testing using SETBIT

[34/36 done]: unit/bitops (24 seconds)

Testing unit/memefficiency

[ok]: Memory efficiency with values in range 32

[ok]: Memory efficiency with values in range 64

[ok]: Memory efficiency with values in range 128

[ok]: Memory efficiency with values in range 1024

[ok]: Memory efficiency with values in range 16384

[35/36 done]: unit/memefficiency (320 seconds)

Testing unit/hyperloglog

[ok]: HyperLogLog self test passes

[ok]: PFADD without arguments creates an HLL value

[ok]: Approximated cardinality after creation is zero

[ok]: PFADD returns 1 when at least 1 reg was modified

[ok]: PFADD returns 0 when no reg was modified

[ok]: PFADD works with empty string (regression)

[ok]: PFCOUNT returns approximated cardinality of set

[ok]: HyperLogLogs are promote from sparse to dense

[ok]: HyperLogLog sparse encoding stress test

[ok]: Corrupted sparse HyperLogLogs are detected: Additionl at tail

[ok]: Corrupted sparse HyperLogLogs are detected: Broken magic

[ok]: Corrupted sparse HyperLogLogs are detected: Invalid encoding

[ok]: Corrupted dense HyperLogLogs are detected: Wrong length

[ok]: PFADD, PFCOUNT, PFMERGE type checking works

[ok]: PFMERGE results on the cardinality of union of sets

[ok]: PFCOUNT multiple-keys merge returns cardinality of union

[ok]: PFDEBUG GETREG returns the HyperLogLog raw registers

[ok]: PFADD / PFCOUNT cache invalidation works

[36/36 done]: unit/hyperloglog (65 seconds)


                   The End


Execution time of different units:

  0 seconds - unit/printver

  1 seconds - unit/auth

  3 seconds - unit/protocol

  55 seconds - unit/basic

  2 seconds - unit/scan

  16 seconds - unit/type/list

  22 seconds - unit/type/list-2

  64 seconds - unit/type/list-3

  38 seconds - unit/type/set

  43 seconds - unit/type/zset

  27 seconds - unit/type/hash

  51 seconds - unit/sort

  11 seconds - unit/expire

  29 seconds - unit/other

  2 seconds - unit/multi

  1 seconds - unit/quit

  42 seconds - unit/aofrw

  121 seconds - integration/replication

  50 seconds - integration/replication-2

  97 seconds - integration/replication-3

  136 seconds - integration/replication-4

  46 seconds - integration/replication-psync

  5 seconds - integration/aof

  2 seconds - integration/rdb

  1 seconds - integration/convert-zipmap-hash-on-load

  1 seconds - unit/pubsub

  1 seconds - unit/slowlog

  6 seconds - unit/scripting

  28 seconds - unit/maxmemory

  0 seconds - unit/introspection

  2 seconds - unit/limits

  222 seconds - unit/obuf-limits

  8 seconds - unit/dump

  24 seconds - unit/bitops

  320 seconds - unit/memefficiency

  65 seconds - unit/hyperloglog


\o/ All tests passed without errors!


Cleanup: may take some time... OK

make[1]: Leaving directory '/home/pi/redis-2.8.19/src'

pi@raspberrypi ~/redis-2.8.19 $ 

pi@raspberrypi ~/redis-2.8.19 $ make install

cd src && make install

make[1]: Entering directory '/home/pi/redis-2.8.19/src'


Hint: It's a good idea to run 'make test' ;)


    INSTALL install

    INSTALL install

    INSTALL install

    INSTALL install

    INSTALL install

make[1]: Leaving directory '/home/pi/redis-2.8.19/src'


pi@raspberrypi ~/redis-2.8.19 $ redis-server &

[1] 8838

pi@raspberrypi ~/redis-2.8.19 $ [8838] 26 Mar 22:42:08.906 # Warning: no config file specified, using the default config. In order to specify a config file use redis-server /path/to/redis.conf

[8838] 26 Mar 22:42:08.917 # You requested maxclients of 10000 requiring at least 10032 max file descriptors.

[8838] 26 Mar 22:42:08.917 # Redis can't set maximum open files to 10032 because of OS error: Operation not permitted.

[8838] 26 Mar 22:42:08.917 # Current maximum open files is 1024. maxclients has been reduced to 4064 to compensate for low ulimit. If you need higher maxclients increase 'ulimit -n'.

[8838] 26 Mar 22:42:08.927 # Warning: 32 bit instance detected but no memory limit set. Setting 3 GB maxmemory limit with 'noeviction' policy now.

                _._                                                  

           _.-``__ ''-._                                             

      _.-``    `.  `_.  ''-._           Redis 2.8.19 (00000000/0) 32 bit

  .-`` .-```.  ```\/    _.,_ ''-._                                   

 (    '      ,       .-`  | `,    )     Running in stand alone mode

 |`-._`-...-` __...-.``-._|'` _.-'|     Port: 6379

 |    `-._   `._    /     _.-'    |     PID: 8838

  `-._    `-._  `-./  _.-'    _.-'                                   

 |`-._`-._    `-.__.-'    _.-'_.-'|                                  

 |    `-._`-._        _.-'_.-'    |           http://redis.io        

  `-._    `-._`-.__.-'_.-'    _.-'                                   

 |`-._`-._    `-.__.-'    _.-'_.-'|                                  

 |    `-._`-._        _.-'_.-'    |                                  

  `-._    `-._`-.__.-'_.-'    _.-'                                   

      `-._    `-.__.-'    _.-'                                       

          `-._        _.-'                                           

              `-.__.-'                                               


[8838] 26 Mar 22:42:08.930 # Server started, Redis version 2.8.19

[8838] 26 Mar 22:42:08.930 # WARNING overcommit_memory is set to 0! Background save may fail under low memory condition. To fix this issue add 'vm.overcommit_memory = 1' to /etc/sysctl.conf and then reboot or run the command 'sysctl vm.overcommit_memory=1' for this to take effect.

[8838] 26 Mar 22:42:08.931 # WARNING: The TCP backlog setting of 511 cannot be enforced because /proc/sys/net/core/somaxconn is set to the lower value of 128.

[8838] 26 Mar 22:42:08.931 * DB loaded from disk: 0.000 seconds

[8838] 26 Mar 22:42:08.931 * The server is now ready to accept connections on port 6379


pi@raspberrypi ~/redis-2.8.19 $ redis-cli

127.0.0.1:6379> info

# Server

redis_version:2.8.19

redis_git_sha1:00000000

redis_git_dirty:0

redis_build_id:a1f28ba1e68cacbf

redis_mode:standalone

os:Linux 3.18.7-v7+ armv7l

arch_bits:32

multiplexing_api:epoll

gcc_version:4.6.3

process_id:8838

run_id:b14eb8838f7c562107c009378e7dfa60c7a493a6

tcp_port:6379

uptime_in_seconds:226

uptime_in_days:0

hz:10

lru_clock:1314194

config_file:


# Clients

connected_clients:1

client_longest_output_list:0

client_biggest_input_buf:0

blocked_clients:0


# Memory

used_memory:442200

used_memory_human:431.84K

used_memory_rss:3129344

used_memory_peak:442200

used_memory_peak_human:431.84K

used_memory_lua:26624

mem_fragmentation_ratio:7.08

mem_allocator:jemalloc-3.6.0


# Persistence

loading:0

rdb_changes_since_last_save:0

rdb_bgsave_in_progress:0

rdb_last_save_time:1427377328

rdb_last_bgsave_status:ok

rdb_last_bgsave_time_sec:-1

rdb_current_bgsave_time_sec:-1

aof_enabled:0

aof_rewrite_in_progress:0

aof_rewrite_scheduled:0

aof_last_rewrite_time_sec:-1

aof_current_rewrite_time_sec:-1

aof_last_bgrewrite_status:ok

aof_last_write_status:ok


# Stats

total_connections_received:1

total_commands_processed:0

instantaneous_ops_per_sec:0

total_net_input_bytes:14

total_net_output_bytes:0

instantaneous_input_kbps:0.00

instantaneous_output_kbps:0.00

rejected_connections:0

sync_full:0

sync_partial_ok:0

sync_partial_err:0

expired_keys:0

evicted_keys:0

keyspace_hits:0

keyspace_misses:0

pubsub_channels:0

pubsub_patterns:0

latest_fork_usec:0


# Replication

role:master

connected_slaves:0

master_repl_offset:0

repl_backlog_active:0

repl_backlog_size:1048576

repl_backlog_first_byte_offset:0

repl_backlog_histlen:0


# CPU

used_cpu_sys:0.30

used_cpu_user:0.16

used_cpu_sys_children:0.00

used_cpu_user_children:0.00


# Keyspace

127.0.0.1:6379> 

127.0.0.1:6379> set raspberry pi

OK

127.0.0.1:6379> get raspberry

"pi"

127.0.0.1:6379> del raspberry

(integer) 1

127.0.0.1:6379> 


posted by 고급코드 고급코드

라즈베리파이 타임존 설정 (Raspberry Pi Setting the Timezone)


보통 SD에 기본 이미지 설치시 타임존이 UTC 로 되어있을 경우가 있음.


방법1. localtime 파일 복사


pi@raspberrypi  $ date

2015. 03. 22. (일) 20:44:45 UTC


설정

pi@raspberrypi $ sudo cp /usr/share/zoneinfo/Asia/Seoul /etc/localtime


설정 확인

pi@raspberrypi $ date

2015. 03. 23. (월) 05:57:20 KST



방법2. tzselect 명령 이용

pi@raspberrypi ~ $ tzselect

Please identify a location so that time zone rules can be set correctly.

Please select a continent or ocean.

 1) Africa

 2) Americas

 3) Antarctica

 4) Arctic Ocean

 5) Asia

 6) Atlantic Ocean

 7) Australia

 8) Europe

 9) Indian Ocean

10) Pacific Ocean

11) none - I want to specify the time zone using the Posix TZ format.

#? 5

Please select a country.

 1) Afghanistan  18) Israel    35) Palestine

 2) Armenia  19) Japan    36) Philippines

 3) Azerbaijan  20) Jordan    37) Qatar

 4) Bahrain  21) Kazakhstan    38) Russia

 5) Bangladesh  22) Korea (North)    39) Saudi Arabia

 6) Bhutan  23) Korea (South)    40) Singapore

 7) Brunei  24) Kuwait    41) Sri Lanka

 8) Cambodia  25) Kyrgyzstan    42) Syria

 9) China  26) Laos    43) Taiwan

10) Cyprus  27) Lebanon    44) Tajikistan

11) East Timor  28) Macau    45) Thailand

12) Georgia  29) Malaysia    46) Turkmenistan

13) Hong Kong  30) Mongolia    47) United Arab Emirates

14) India  31) Myanmar (Burma)    48) Uzbekistan

15) Indonesia  32) Nepal    49) Vietnam

16) Iran  33) Oman    50) Yemen

17) Iraq  34) Pakistan

#? 23


The following information has been given:


Korea (South)


Therefore TZ='Asia/Seoul' will be used.

Local time is now: Mon Mar 23 06:01:23 KST 2015.

Universal Time is now: Sun Mar 22 21:01:23 UTC 2015.

Is the above information OK?

1) Yes

2) No

#? 1


You can make this change permanent for yourself by appending the line

TZ='Asia/Seoul'; export TZ

to the file '.profile' in your home directory; then log out and log in again.


Here is that TZ value again, this time on standard output so that you

can use the /usr/bin/tzselect command in shell scripts:

Asia/Seoul

pi@raspberrypi ~ $ 




방법3. dpkg-reconfigure tzdata 명령 이용

pi@raspberrypi ~ $ sudo dpkg-reconfigure tzdata


Current default time zone: 'Asia/Seoul'

Local time is now:      Mon Mar 23 06:04:17 KST 2015.

Universal Time is now:  Sun Mar 22 21:04:17 UTC 2015.


posted by 고급코드 고급코드
HardWare 2015.03.21 05:15


펌웨어 정보
- 펌웨어 상태 : 정식 버전
- 펌웨어 파일 :  한글 -a3004ns_kr_9_40.bin / 영문 - a3004ns_en_9_40.bin

기능 추가 및 변경 사항
- 5GHz 최대 무선 성능 개선
- 미디어 서버(DLNA) 지원 
- 온라인 펌웨어 업그레이드 지원
    버튼 클릭만으로 최신 버전으로 업데이트
    스마트 폰등의 스마트기기에서도 업그레이드 가능 
    공유기가 인터넷에 연결되어있어야 가능함 


주의 사항
예기치 못한 상황으로 인한 업그레이드 실패시, 펌웨어 복구 도우미를 이용하여 펌웨어를 복구할 수 있습니다.






Good!

posted by 고급코드 고급코드
Computer_IT/FLEX_AIR 2015.03.05 10:24



http://wonderfl.net/c/dcTU



특징

마우스 따라다니는 tail

부셔지는 Particle

Base64텍스트를 Base64ImageLoader 를 이용하여 BitMap화





'Computer_IT > FLEX_AIR' 카테고리의 다른 글

[wonderfl] Lightning Effect (as3)  (0) 2015.06.15
[wonderfl] particle 참고 할 샘플  (0) 2015.03.05
Adobe Flash Player Download Link  (0) 2015.01.14
wonderfl - MoviePuzzleTest  (0) 2014.10.31
wonderfl-긴 이미지 붙여서 스크룰  (0) 2014.10.29
Apache Flex SDK 4.13.0 release  (0) 2014.07.28
posted by 고급코드 고급코드
HardWare 2015.02.28 08:14



저렴하게 나온 ebay발 LG G Pad V410 LTE - ( GPS )

http://www.ebay.com/itm/381129698667








실질적인 GPS 는 어떻게 잡히는지 [AndroiTS] GPS Test로 체크해본 결과 ...



네비로서의 용도는 금상첨화!


posted by 고급코드 고급코드
Computer_IT/FLEX_AIR 2015.01.14 07:41

Flash Player for Internet Explorer - ActiveX

http://fpdownload.macromedia.com/pub/flashplayer/latest/help/install_flash_player_ax.exe


Flash Player for Firefox - NPAPI

http://fpdownload.macromedia.com/pub/flashplayer/latest/help/install_flash_player.exe


Flash Player for Opera and Chromium-based browsers - PPAPI

http://fpdownload.macromedia.com/pub/flashplayer/latest/help/install_flash_player_ppapi.exe


Windows8 은 해당사항 없음

'Computer_IT > FLEX_AIR' 카테고리의 다른 글

[wonderfl] Lightning Effect (as3)  (0) 2015.06.15
[wonderfl] particle 참고 할 샘플  (0) 2015.03.05
Adobe Flash Player Download Link  (0) 2015.01.14
wonderfl - MoviePuzzleTest  (0) 2014.10.31
wonderfl-긴 이미지 붙여서 스크룰  (0) 2014.10.29
Apache Flex SDK 4.13.0 release  (0) 2014.07.28
posted by 고급코드 고급코드
Computer_IT/FLEX_AIR 2014.10.31 00:48

 

image

 

http://wonderfl.net/c/sclF

posted by 고급코드 고급코드
Computer_IT/FLEX_AIR 2014.10.29 21:25

http://wonderfl.net/c/jbKW

image

posted by 고급코드 고급코드
세상살면서 2014.10.28 21:55

olleh tv 일반매장용 비즈형(기본팩)

부가상품 멀티품팩

저렴하고 싸긴 싼데...

단점으로는

1. 셋탑을 이사 해도 다음사람에게 전달하고 간다.

2. 셋탑이 구형이다.

3. 휴대폰이랑 결합이 안된다. (그래서 저렴)

posted by 고급코드 고급코드
Computer_IT/JAVA 2014.10.20 01:00


 


The following table lists the bug fixes included in JDK 7u72 release:

Bug IdCategorySubcategoryDescription
8036022client-libs2dD3D: rendering with XOR composite causes InternalError.
8019623client-libsjava.awtLack of synchronization in AppContext.getAppContext()
8024061client-libsjava.awtException thrown when drag and drop between two components is executed quickly
8028617client-libsjava.awtDvorak keyboard mapping not honored when ctrl key pressed
8016545client-libsjava.beansjava.beans.XMLEncoder.writeObject output is wrong
8036819client-libsjavax.accessibilityJAB: mneumonics not read for textboxes
8036983client-libsjavax.accessibilityJAB:Multiselection Ctrl+CursorUp/Down and ActivateDescenderPropertyChanged event
8028616client-libsjavax.swingHtmleditorkit parser doesn't handle leading slash (/)
8032872client-libsjavax.swing[macosx] Cannot select from JComboBox in a JWindow
8032874client-libsjavax.swingArrayIndexOutOfBoundsException in JTable while clearing data in JTable
8032878client-libsjavax.swingEditable combos in table do not behave as expected
8041451core-libsjavax.namingcom.sun.jndi.ldap.Connection:ReadTimeout should abandon ldap request
8042857core-libsjavax.naming14 stuck threads waiting for notification on LDAPRequest
7142035core-svcjava.lang.instrumentassert in j.l.instrument agents during shutdown when daemon thread is running
8028623core-svctoolsSA: hash codes in SymbolTable mismatching java_lang_String::hash_code for extended characters.
8028619deploydeployment_toolkitDisplay issue of java control panel in ko and ja locale
8031490deploydeployment_toolkitBroken Java SE 7 jnlp samples (app2 and app3)
8038463deploydeployment_toolkitJava Control Panel doesn't display correctly in high resolution
8025051globalizationlocale-dataUpdate resource files for TimeZone display names
8039298hotspotcompilerC2: assert(base == NULL || t_adr->isa_rawptr() || !phase->type(base)->higher_equal(TypePtr::NULL_PTR)) failed: NULL+offs not RAW address?
8038925hotspotgcJava with G1 crashes in dump_instance_fields using jmap or jcmd without fullgc
8019324hotspotruntimeassert(_f2 == 0 || _f2 == f2) failed: illegal field change
8031290hotspotruntimeAdjust call to getisax() for additional words returned
8033696hotspotruntime"assert(thread != NULL) failed: just checking" due to Thread::current() and JNI pthread interaction
8051012hotspotruntimeRegression in verifier for <init> method call from inside of a branch
8021804security-libsjava.securityCertpath validation fails if validity period of root cert does not include validity period of intermediate cert
8050158security-libsjavax.net.sslIntroduce system property to maintain RC4 preference order
7047033security-libsjavax.smartcardio(smartcardio) Card.disconnect(boolean reset) does not reset when reset is true
7195480security-libsjavax.smartcardiojavax.smartcardio does not detect cards on Mac OS X
8039319security-libsjavax.smartcardio(smartcardio) Card.transmitControlCommand() does not work on Mac OS X
8043507security-libsjavax.smartcardio(smartcardio) javax.smartcardio.CardTerminals.list() fails on MacOSX
8046343security-libsjavax.smartcardio(smartcardio) CardTerminal.connect('direct') does not work on MacOSX
8049250security-libsjavax.smartcardio(smartcardio) Need a flag to invert the Card.disconnect(reset) argument
8036709toolsjarJava 7 jarsigner displays warning about cert policy tree
8033113xmljax-wswsimport fails on WSDL:header parameter name customization
8029837xmljaxpNPE seen in XMLDocumentFragmentScannerImpl.setProperty since 7u40b33


http://www.oracle.com/technetwork/java/javase/2col/7u72-bugfixes-2298229.html




The following table lists the bug fixes included in JDK 7u71 release:

Bug IdCategorySubcategoryDescription
8032788client-libsjava.awtImageIcon constructor throws an NPE and hangs when passed a null String parameter
8057184client-libsjavax.swingJCK8's api/javax_swing/JDesktopPane/descriptions.html#getset failed with GTKLookAndFeel on Linux and Solaris run v.s. JDK8+
8001105core-libsjava.lang.invokefindVirtual of Object[].clone produces internal error
8031502core-libsjava.lang.invokeJSR292: IncompatibleClassChangeError in LambdaForm for CharSequence.toString() method handle type converter
8027821deploy For signed jars without manifest "Permissions", there is still security warning dialog before Application Error (Or blocked) Dialog.
8054904deploy Webstart cache path error for Java >= 7u65
8032883deploypluginjava.lang.UnsupportedClassVersionError occurs while accessing an applet
8036620deploypluginJAR file is downloaded on DownloadService.removeResource, if it is not in Deployment Cache
8040786deploypluginText is truncated in JavaScript to Java security warning dialog on OS X
8043478deploypluginOracle Linux 5.x: Expired JRE disabled in the browser automatically and no native dialog prompting for the JRE update
8025726deploywebstartCertificate rule in DRS does not work for Java Web Start app when caching is turned off
8051891deploywebstartSWT cannot load native look&feel
8050485hotspotruntimesuper() in a try block in a ctor may need to cause VerifyError
8027686install Fail to install on MacOS 10.10
7160837security-libsjavax.cryptoDigestOutputStream does not turn off digest calculation when "close()" is called
8028627security-libsjavax.cryptoUnsynchronized code path from javax.crypto.Cipher to the WeakHashMap used by JceSecurity to store codebase mappings


http://www.oracle.com/technetwork/java/javase/2col/7u71-bugfixes-2298226.html







The following table lists the bug fixes included in JDK 7u65 release:

Bug IdCategorySubcategoryDescription
8023990client-libs2dRegression: postscript size increase from 6u18
8019990client-libsjava.awt:i18nIM candidate window appears on the South-East corner of the display
8013611client-libsjavax.swingModal dialog fails to obtain keyboard focus
8001108core-libsjava.lang.invokean attempt to use "<init>" as a method name should elicit NoSuchMethodException
8001109core-libsjava.lang.invokearity mismatch on a call to spreader method handle should elicit IllegalArgumentException
8024616core-libsjava.lang.invokeJSR292: lazily initialize core NamedFunctions used for bootstrapping
8043012core-libsjava.util:i18n(tz) Support tzdata2014c
8019274deploy RMI thread can no longer call out to AWT thread for webstart app
8032781deploydeployment_toolkitRun rule not working in case of html applet
8030636deploypluginAccessibility class in jar on -xbootclasspath/a is not loaded by jvm
8031996deploypluginJava.Lang.Reflect.InvocationTargetException When Cache Has Disabled
8032206deploypluginApplet with jnlp.Packenabled=True And jnlp.versionEnabled=True Fails
8034230deploypluginApplet caller check should not compare URLs
8035449deploypluginsecurity prompt is shown twice when 'Do not show' checkbox is checked
8041339deploywebstartJNLP with java-vm-args whose length exceeded 512 chars failed to get loaded with CouldNotLoadArgumentException
8013836globalizationlocale-datagetFirstDayOfWeek reports wrong day for pt-BR locale
8042789other-libscorbaorg.omg.CORBA.ORBSingletonClass loading no longer uses context class loader
8035613xmljaxbWith active Securitymanager JAXBContext.newInstance fails




The following table lists the bug fixes included in JDK 7u60 release:

Bug IDCategorySub- CategoryDescription
JDK-4673406client-libs2dRFE: Java Printing: Provide a way to display win32 printer driver's dialog
JDK-8005607client-libsjava.awtRecursion in J2DXErrHandler() Causes a Stack Overflow on Linux
JDK-8025775client-libsjava.awtJNI warnings in TryXShmAttach
JDK-6995891client-libsjavax.accessibilityJAWS will occasionally stop speaking focused objects as user TABs -> problem with message queue
JDK-8020457client-libs2dFontmatrix for Type1 fonts is not used correctly
JDK-7129133client-libsjava.awt[macosx] Accelerators are displayed as Meta instead of the Command symbol
JDK-7173464client-libsjava.awtClipboard.getAvailableDataFlavors: Comparison method violates contract
JDK-8021943client-libsjava.awtFileDialog getFile returns corrupted string after previous setFile
JDK-8023474client-libsjava.awtFirst mousepress doesn't start editing in JTree
JDK-8025145client-libsjava.awt[macosx]: java 7 does not recognize tiff image on clipboard
JDK-8028054client-libsjava.beanscom.sun.beans.finder.MethodFinder has unsynchronized access to a static Map
JDK-8022966client-libsjavax.accessibilityJava Access Bridge no longer usable with screen magnifiers
JDK-8023565client-libsjavax.imageioJPG causes javax.imageio.IIOException: ICC APP2 encoutered without prior JFIF!
JDK-8022997client-libsjavax.swing[macosx] Remaining duplicated key events
JDK-8023392client-libsjavax.swingSwing text components printed with spaces between chars
JDK-8024395client-libsjavax.swingImprove fix for line break calculations
JDK-8027066client-libsjava.beansXMLDecoder in java 7 cannot properly deserialize object arrays
JDK-8016833client-libsjavax.swingUnderlines and strikethrough not rendering correctly
JDK-8035897core-libsjava.netBetter memory allocation for file descriptors greater than 1024 on macosx
JDK-7199674core-libsjava.lang(props) user.home property does not return an accessible location in sandboxed environment [macosx]
JDK-8023130core-libsjava.lang(process) ProcessBuilder#inheritIO does not work on Windows
JDK-8024521core-libsjava.lang(process) Async close issues with Process InputStream
JDK-8019184core-libsjava.lang.invokeMethodHandles.catchException() fails when methods have 8 args + varargs
JDK-8006395core-libsjava.netRace in async socket close on Linux
JDK-8024952core-libsjava.netClassCastException in PlainSocketImpl.accept() when using custom socketImpl
JDK-8023881core-libsjava.netIDN.USE_STD3_ASCII_RULES option is too strict to use Unicode in IDN.toASCII
JDK-8011944core-libsjava.utilSort fails with ArrayIndexOutOfBoundsException
JDK-8023563core-libsjava.util:i18nBottleneck in java.util.TimeZone.getDefaultInAppContext
JDK-8027351core-libs (ref) Private finalize method invoked in preference to protected superclass method
JDK-8038306core-libs (tz) Support tzdata2014b
JDK-8016018core-libsjava.lang(str) Error in description of the method indexOf in the class StringBuffer
JDK-8020037core-libsjava.langString.toLowerCase incorrectly increases length, if string contains \u0130 char
JDK-8021368core-libsjava.langLaunch of Java Web Start app fails with ClassCircularityError exception in 7u25
JDK-8012244core-libsjava.netjava/net/Socket/asyncClose/Race.java fails intermittently on Windows
JDK-8021820core-libsjava.netNumber of opened files used in select() is limited to 1024 [macosx]
JDK-8022584core-libsjava.netMemory leak in NetworkInterface methods ex. isUP(), isLoopback()
JDK-8034181core-libsjava.net(sctp) SIGBUS in SctpChannelImpl receive
JDK-7074436core-libsjava.nio(sc) SocketChannel can do short gathering writes when channel configured blocking (win)
JDK-8014394core-libsjava.nio(fs) WatchService failing when watching \\server\$d
JDK-8024788core-libsjava.nio(fs) Files.readAllBytes uses FileChannel which may not be supported by all providers
JDK-8012326core-libsjava.nio.charsetsDeadlock occurs when Charset.availableCharsets() is called by several threads at the same time
JDK-8016127core-libsjava.util.loggingNLS: logging.properties translatability recommendation
JDK-8025512core-libsjava.util.loggingNPE with logging while launching webstart on jre7u40 if logging is disabled
JDK-8029281core-libsjava.util.loggingSynchronization issues in Logger and LogManager
JDK-8011194core-libsjava.util:i18nApps launched via double-clicked .jars have file.encoding value of US-ASCII on Mac OS X
JDK-7147084core-libsjava.lang(process) appA hangs when read output stream of appB which starts appC that runs forever
JDK-8007454core-libsjava.lang(process) SetHandleInformation parameters DWORD (not BOOLEAN)
JDK-8024356core-libsjava.langDouble.parseDouble() is slow for long Strings
JDK-7123493core-libsjava.lang:reflect(proxy) Proxy.getProxyClass doesn't scale under high load
JDK-7171591core-libsjava.netgetDefaultScopeID() in src/solaris/native/java/net/net_util_md.c should return a value
JDK-8003895core-libsjava.niojava/nio/channels/AsynchronousChannelGroup/Unbounded.java failing again [win64]
JDK-8020669core-libsjava.nio(fs) Files.readAllBytes() does not read any data when Files.size() is 0
JDK-8024131core-libsjava.util.loggingIssues with cached localizedLevelName in java.util.logging.Level
JDK-8013155core-libsjava.util.jar[pack200] improve performance of pack200
JDK-7192942core-libsjava.util:collections(coll) Inefficient calculation of power of two in HashMap
JDK-8020530core-svcjava.lang.managementNon heap memory size calculated incorrectly; IllegalArgumentException: committed = N should be < max
JDK-6566891core-svcjavax.managementRMIConnector: map value referencing map key in WeakHashMap prevents map entry to be removed
JDK-8023954core-svcjavax.managementMBean*Info.equals: throw NPE
JDK-8023529core-svcjavax.managementOpenMBeanInfoSupport.equals/hashCode throw NPE
JDK-8023669core-svcjavax.managementMBean*Info.hashCode : NPE
JDK-8009558core-svcdebuggerlinked_md.c::dll_build_name can get stuck in an infinite loop
JDK-8023786core-svctools(jdk) setjmp/longjmp changes the process signal mask on OS X
JDK-8028629deploydeployment_toolkitdeployJava.getBrowser() is broken and js.UserAgentTest fails because it always returns 'MSIE'
JDK-8023711deploywebstartRESOURCE HAS FUTURE EXPIRES MESSAGES ON JAVA CONSOLE WITH JRE 1.7.21
JDK-8016489deployplugin[macosx] FireFox: NPN_ConvertPoint is not being called on plugin main thread
JDK-8016513deploywebstartWebstart throws StringIndexOutOfBoundsException using property and Java-VM-args
JDK-8023938deploywebstart64-bit javaws.exe left behind in system32
JDK-8014528deploy Some Solaris sparc .so files still do not have execute bit set
JDK-8013948deployplugin[macosx] Unable type into online word games on MacOSX on Safari
JDK-8004051embeddedhotspotARM: assert(_oprs_len[mode] < maxNumberOfOperands) failed: array overflow
JDK-8031743hotspotcompilerC2: loadI2L_immI broken for negative memory values
JDK-8032207hotspotcompilerC2: assert(VerifyOops || MachNode::size(ra_) <= (3+1)*4) failed: bad fixed size
JDK-8023472hotspotcompilerC2 optimization breaks with G1
JDK-8024830hotspotcompilerSEGV in org.apache.lucene.codecs.compressing.CompressingTermVectorsReader.get
JDK-8024919hotspotcompilerG1: SPECjbb2013 crashes due to a broken object reference
JDK-8029366hotspotcompilerShouldNotReachHere error when creating an array with component type of void
JDK-8014052hotspotcompilerJSR292: assert(end_offset == next_offset) failed: matched ending
JDK-8017065hotspotcompilerC2 allows safepoint checks to leak into G1 pre-barriers
JDK-8023004hotspotcompilerJSR 292: java.lang.RuntimeException: Original target method was called.
JDK-8027751hotspotcompilerC1 crashes in Weblogic with G1 enabled
JDK-8024838hotspotgcSignificant slowdown due to transparent huge pages
JDK-8025441hotspotgcG1: assert "assert(thread < _num_vtimes) failed: just checking" fails when G1ConcRefinementThreads > ParallelGCThreads
JDK-8007074hotspotgcSIGSEGV at ParMarkBitMap::verify_clear()
JDK-8023720hotspotsvc(hotspot) setjmp/longjmp changes the process signal mask on OS X
JDK-8028412hotspotsvcAsyncGetCallTrace() is broken on x86 in JDK 7u40
JDK-8037340hotspotsvcLinux semaphores to use CLOCK_REALTIME
JDK-8021898hotspotcompilerBroken JIT compiler optimization for loop unswitching
JDK-8022585hotspotcompilerJVM crashes when ran with -XX:+PrintInlining
JDK-8022993hotspotcompilerConvert MAX_UNROLL constant to LoopMaxUnroll C2 flag
JDK-8026293hotspotcompilerSchedule part of G1 pre-barrier late
JDK-6990419hotspotgcCMS: Remaining work for 6572569: consistently skewed work distribution in (long) re-mark pauses
JDK-7145569hotspotgcG1: optimize nmethods scanning
JDK-8025305hotspotgcCleanup CardTableModRefBS usage in G1
JDK-8027454hotspotgcDo not traverse string table during G1 remark when treating them as strong roots during initial mark
JDK-8027455hotspotgcImprove symbol table scan times during gc pauses
JDK-8028391hotspotgcMake the Min/MaxHeapFreeRatio flags manageable
JDK-8023145hotspotgcG1: G1CollectedHeap::mark_strong_code_roots() needs to handle ParallelGCThreads=0
JDK-8026848hotspotgc-XX:+G1SummarizeRSetStats can result in wrong exit code and crash
JDK-8027756hotspotgcassert(!hr->isHumongous()) failed: code root in humongous region?
JDK-8006731hotspotjvmtiJSR 292: the VM_RedefineClasses::rewrite_cp_refs_in_method() must support invokedynamic
JDK-7187554hotspotjvmtiJSR 292: JVMTI PopFrame needs to handle appendix arguments
JDK-7194607hotspotjvmtiVerifyLocalVariableTableOnRetransformTest.sh fails after JSR-292 merge
JDK-8006542hotspotjvmtiJSR 292: the VM_RedefineClasses::append_entry() must support invokedynamic entry kinds
JDK-8007037hotspotjvmtiJSR 292: the VM_RedefineClasses::append_entry() should do cross-checks with indy operands
JDK-6900441hotspotruntimePlatformEvent.park(millis) on Linux could still be affected by changes to the time-of-day clock
JDK-8017498hotspotruntimeJVM crashes when native code calls sigaction(sig) where sig>=0x20
JDK-7191817hotspotruntime-XX:+UseSerialGC -XX:+UseLargePages crashes with SIGFPE on MacOS X
JDK-8013895hotspotgcG1: G1SummarizeRSetStats output on Linux needs improvement
JDK-8014078hotspotgcG1: improve remembered set summary information by providing per region type information
JDK-8015244hotspotgcG1: Verification after a full GC is incorrectly placed
JDK-8027476hotspotgcImprove performance of Stringtable unlink
JDK-7133122hotspotsvcSA throws sun.jvm.hotspot.debugger.UnmappedAddressException when it should not
JDK-8025812hotspotsvctmtools/jmap/heap_config tests fail on Linux-ia32 because it 'Can't attach to the core file'
JDK-8028128hotspotsvcAdd a type safe alternative for working with counter based data
JDK-8017195other-libscorbaIntroduce option to setKeepAlive parameter on CORBA sockets
JDK-8031572security-libsjava.securityjarsigner -verify exits with 0 when a jar file is not properly signed
JDK-8028351security-libsorg.ietf.jgss:krb5JWS doesn't get authenticated when using kerberos auth proxy
JDK-8021788security-libs JarInputStream doesn't provide certificates for some file under META-INF
JDK-8013809security-libsjavax.net.ssldeadlock in SSLSocketImpl between between write and close
JDK-8024861security-libsjavax.securityIncomplete token triggers GSS-API NullPointerException
JDK-8019267security-libsorg.ietf.jgssNPE in AbstractSaslImpl when trace level >= FINER in KRB5
JDK-8016594security-libsorg.ietf.jgss:krb5Native Windows ccache still reads DES tickets
JDK-8016110toolslauncherJapanese char (MS932) 0x5C cannot be used as an argument when quoted
JDK-8030698toolsjconsoleSome messages in jconsole in 7u40 (and later) aren't displayed correctly
JDK-8030878toolsjconsoleJConsole issues meaningless message if SSL connection fails
JDK-8016271xmljax-wswsimport -clientjar does not create portable jars on windows due to hardcoded backslash
JDK-8009579xmljaxpXpathexception does not honor initcause()
JDK-8004476xmljavax.xml.transformXSLT Extension Functions Don't Work in WebStart
JDK-8015978xmljavax.xml.xpathIncorrect transformation of XPath expression "string(-0)"
JDK-8024707xmljaxpTransformerException : item() return null with node list of length != 1
JDK-8015092xmljaxpSchemaFactory cannot parse schema if whitespace added within patterns in Selector XPath expression
JDK-8015243xmljaxp

SchemaFactory does not catch enum. value that is not in the value space of the base type, anyURI.




The following table lists the bug fixes included in JDK 7u55 release:

Bug Id CategorySub-CategoryDescription
JDK-7190349client-libs2d[macosx] Text (Label) is incorrectly drawn with a rotated g2d
JDK-8013569client-libs2d[macosx] JLabel preferred size incorrect on retina displays with non-default font size
JDK-6571600client-libsjava.awtJNI use results in UnsatisfiedLinkError looking for libmawt.so
JDK-8025588client-libsjava.awt[macosx] Frozen AppKit thread in 7u40
JDK-5049299core-libsjava.lang(process) Use posix_spawn, not fork, on S10 to avoid swap exhaustion
JDK-8020191core-libsjava.langSystem.getProperty( " os.name " ) returns " Windows NT (unknown) " on Windows 8.1
JDK-8030822core-libsjava.time(tz) Support tzdata2013i
JDK-8019853core-libsjava.util.loggingBreak logging and AWT circular dependency
JDK-8026474deploydeployment_toolkitdeployJava.js versioncheck doesn't work in IE11
JDK-8028691deploypluginloading browser proxy via config script should not trigger JAR download
JDK-8029649deploypluginReduce dialog frequency when app is run multiple times
JDK-8033705deploypluginArray out of bounds exception in PluginMain.performSSVValidation
JDK-8033779deploypluginJRE 7u51 Plugin Failing to Run Older JRE Version < 1.6.0
JDK-8029922deploywebstart32-bit only Java Web Start apps fail to run on 32- and 64-bit JRE configs
JDK-8031579deploywebstartSpurious Missing Manifest Permissions Attribute Warning When Launching versioned Java Web Start app
JDK-8024830hotspotcompilerSEGV in org.apache.lucene.codecs.compressing.CompressingTermVectorsReader.get
JDK-8035283hotspotcompilerSecond phase of branch shortening doesn't account for loop alignment
JDK-8035618other-libscorba:rmi-iiopFour api/org_omg/CORBA TCK tests fail under plugin only

http://www.oracle.com/technetwork/java/javase/2col/7u55-bugfixes-2180733.html




The following table lists the bug fixes included in JDK 7u51 release:

Bug IdCategorySub-CategoryDescription
8023310client-libsjava.beansThread contention in the method Beans.IsDesignTime()
8027370core-libsjava.time(tz) Support tzdata2013h
8020943core-svcjava.lang.managementMemory leak when GCNotifier uses create_from_platform_dependent_str()
8026002deploypluginCertificate based DRS rule does not work when main jar is in nested resource block or extension
8027029deploypluginDeadlock in caching code launching application with a large number of jars (~100).
8027405deploypluginProperly configured LiveConnect Applets must work even on JREs below the baseline by default
8029135deploypluginESL not working for JNLP applications without an href
8016849deploypluginApplets don't get loaded and the Firefox crashes under Mac OS X
8025890deploypluginliveconnect dialog is showing the publisher unknown
8025956deploypluginWarning message appears in all the jar files not only the main jar file
8023822deploywebstartREGRESSION:NPE exception throws when Java Web start apps fails with no logging
8021257other-libscorbacom.sun.corba.se.** should be on restricted package list
8027943other-libscorbaserial version of com.sun.corba.se.spi.orbutil.proxy.CompositeInvocationHandlerImpl changed in 7u45
8028215other-libscorbaORB.init fails with SecurityException if properties select the JDK default ORB
8014618security-libsjavax.net.sslNeed to strip leading zeros in TlsPremasterSecret of DHKeyAgreement
8028111xmljaxpXML readers share the same entity expansion counter
8029038xmljaxpRevise fix for XML readers share the same entity expansion counter

http://www.oracle.com/technetwork/java/javase/2col/7u51-bugfixes-2100820.html




The following table lists the bug fixes included in JDK 7u40 release:

Bug IDComponentDescription
8001161client-libs[macosx] EmbeddedFrame doesn't become active window
8004316client-libsPrinting an image using AUTOSENSE fails to print
8015375client-libsEdits to text components hang for clipboard access
7068471client-libsNPE in sun.font.FontConfigManager.getFontConfigFont() when libfontconfig.so is not installed
7105640client-libsUnix printing does not check the result of exec'd lpr/lp command
7113017client-libsUse POSIX compliant include file headers in sun/awt/medialib/mlib_types.h
7151427client-libsPotential memory leak in error handling code in X11SurfaceData.c
7152519client-libsDependency on non-POSIX header file <link.h> causes portability problem
7181199client-libs[macosx] Startup is much slower in headless mode for apps using Fonts
7181438client-libs[OGL] Incorrect alpha used, during blit from SW to the texture.
8004821client-libsGraphics2D.drawPolygon() fails with IllegalPathStateException
8004859client-libsGraphics.getClipBounds/getClip return difference nonequivalent bounds, depending from transform.
8008535client-libsJDK7 Printing : CJK and Latin Text in a string overlap.
8012381client-libs[macosx] : Collation selection ignored when printing on MacOSX
8013810client-libsPrintServiceLookup.lookupPrintServices() does not return consistent result
8015334client-libsMemory leak when kerning is used on Windows
8015556client-libs[macosx] surrogate pairs do not render properly (show up as boxes or incorrect glyphs)
8015606client-libsText is not rendered correctly if destination buffer is custom
8019201client-libsRegression: java.awt.image.ConvolveOp throws java.awt.image.ImagingOpException
8011059client-libs[macosx] Make JDK demos look perfect on retina displays
6550588client-libsjava.awt.Desktop cannot open file with Windows UNC filename
7107957client-libsAWT: Native code should include fcntl.h and unistd.h rather than sys/fcntl.h and sys/unistd.h
7109977client-libs[macosx] MixingInHwPanel.java test fails on Mac trying to click in the reserved corner
7124520client-libs[macosx] re:6373505 Toolkit.getScreenResolution() != GraphicsConfiguration.getNormalizingTransform()
7130662client-libsGTK file dialog crashes with a NPE
7146572client-libsenableInputMethod(false) does not work in the TextArea and TextField on the linux platform
7154778client-libs[macosx] NSView-based implementation of sun.awt.EmbeddedFrame
7155378client-libsNeed utils api/field which determines the dead key
7161437client-libs[macosx] awt.FileDialog doesn't respond appropriately for mac when selecting folders
7170655client-libsFrame size does not follow font size change with XToolkit
7170996client-libsRegression : Cannot use IME on JComboBox Japanese(7026055) II
7175183client-libs[macosx] Objective-C exception thrown when switching monitor configuration
7179050client-libs[macosx] Make LWAWT be able to run on AppKit thread
7181710client-libs[macosx] jawt_md.h shipped with jdk is outdated
7193169client-libsThe code example in javadoc of Component.java misses 'implements' keyword
7194469client-libsPressing the Enter key results in an alert tone beep when focus is TextField
7194902client-libs[macosx] closed/java/awt/Button/DoubleActionEventTest/DoubleActionEventTest failed since jdk8b49
7196547client-libs[macosx] Implement dead key detection for KeyEvent
7197619client-libsUsing modifiers for the dead key detection on Windows
7198229client-libs[macosx] Painting during resizing of the frame should be more smooth
7199180client-libs[macosx] Dead keys handling for input methods
7199783client-libsSetting cursor on DragSourceContext does not work on OSX
8000423client-libsDiacritic is not applyed to a base letter on Linux
8000435client-libs[macosx] Button painting error under Java 7 on Mac
8000629client-libs[macosx] Blurry rendering with Java 7 on Retina display
8003169client-libs[macosx] JVM crash after disconnecting from projector
8004344client-libsA crash in ToolkitErrorHandler() in XlibWrapper.c
8005405client-libs[macosx] Drag and Drop: wrong animation when dropped outside any drop target.
8005465client-libs[macosx] Evaluate if checking for the -XstartOnFirstThread is still needed in awt.m
8005932client-libsJava 7 on mac os x only provides text clipboard formats
8005997client-libs[macosx] Printer Dialog opens an additional title bar
8006417client-libsJComboBox.showPopup(), hidePopup() fails in JRE 1.7 on OS X
8006634client-libsUnify LWCToolkit.invokeAndWait() and sun.awt.datatransfer.ToolkitThreadBlockedHandler
8006941client-libs[macosx] Deadlock in drag and drop
8008660client-libsFailure in 2D Queue Flusher thread on Mac
8009012client-libs[macosx] DisplayChangedListener is not implemented in LWWindowPeer/CGraphicsEnvironment
8009911client-libs[macosx] SWT app freeze when going full screen using Java 7 on Mac
8011686client-libs[macosx] AWT accidentally disables the NSApplicationDelegate of SWT, causing loss of OS X integration functionality
8012586client-libs[x11] Modal dialogs for fullscreen window may show behind its owner
8014821client-libsRegression: Focus issues with Oracle WebCenter Capture applet
8015303client-libs[macosx] Application launched via custom URL Scheme does not receive URL
8019265client-libs[macosx] apple.laf.useScreenMenuBar regression comparing with jdk6
8020038client-libs[macosx] Incorrect usage of invokeLater() and likes in callbacks called via JNI from AppKit thread
8020298client-libs[macosx] Incorrect merge in the lwawt code.
8020371client-libs[macosx] applets with Drag and Drop fail with IllegalArgumentException
8021381client-libsJavaFX scene included in Swing JDialog not starting from Web Start
7186794client-libsSetter not found. PropertyDescriptor(PropertyDescriptor,PropertyDescriptor)
7187618client-libsPropertyDescriptor Performance Slow (continue)
7189112client-libsjava.beans.Introspector misses write methods
7192955client-libsIntrospector overide PropertyDescriptor for generic type field defined in super class
8013416client-libsJava Bean Persistence with XMLEncoder
8013557client-libsXMLEncoder in 1.7 can't encode objects initialized in no argument constructor
8009168client-libsaccessibility.properties syntax issue
8020983client-libsOutOfMemoryError caused by non garbage collected JPEGImageWriter Instances
4199622client-libsRFE: JComboBox shouldn't sending ActionEvents for keyboard navigation
4310381client-libsText in multi-row/col JTabbedPane tabs can be truncated/clipped
4631925client-libsJColor Chooser is not fully accessible
6337518client-libsNull Arrow Button Throws Exception in BasicComboBoxUI
6436314client-libsVector could be created with appropriate size in DefaultComboBoxModel
6671481client-libsNPE at javax.swing.plaf.basic.BasicTreeUI$Handler.handleSelection
6877495client-libsJTextField and JTextArea does not support supplementary characters
7024118client-libspossible hardcoded mnemonic for JFileChooser metal and motif l&f
7032018client-libsThe file list in JFileChooser does not have an accessible name
7032436client-libsWhen running with the Nimbus look and feel, the JFileChooser does not display mnemonics
7049024client-libsDnD fails with JTextArea and JTextField
7055065client-libsRegression : JDK 7 : NullPointerException when sorting JTable with empty cell
7068740client-libsIf you wrap a JTable in a JLayer you can't use the page up and page down cmds
7089914client-libsFocus on image icons are not visible in javaws cache with high contrast mode
7123767client-libsWrong tooltip location in Multi-Monitor configurations
7124525client-libs[macosx] No animation on certain Swing components in Aqua LaF
7129742client-libsUnable to view focus in Non-Editable TextArea
7132385client-libs[macosx] IconifyTest of RepaintManager could use some delay
7147075client-libsJTextField doesn't get focus or loses focus forever
7154030client-libsjava.awt.Component.hide() does not repaint parent component
7155298client-libsEditable TextArea/TextField are blocking GUI applications from exit
7155887client-libsComboBox does not display focus outline in GTK L&F
7163696client-libsJCK Swing interactive test JScrollBarTest0013 fails with Nimbus and GTK L&Fs
7163828client-libs[macosx] White-on-yellow "Got Milk?" tooltip in SwingSet2 is empty.
7167780client-libsHang javasoft.sqe.tests.api.javax.swing.Timer.Ctor2Tests
7181403client-libsInvalid MouseEvent conversion with SwingUtilities.convertMouseEvent
7184945client-libs[macosx] NPE in AquaComboBoxUI since jdk7u6b17, jdk8b47
7188612client-libsJTable's AccessibleJTable throws IllegalComponentStateException instead of null
7194184client-libsJColorChooser swatch cannot accessed from keyboard
7197320client-libs[macosx] Full Screen option missing when Window.documentModified
7199708client-libsFileChooser crashs when opening large folder
8002077client-libsPossible mnemonic issue on JFileChooser Save button on nimbus L&F
8002114client-libsfix failed for 7160951: [macosx] ActionListener called twice for JMenuItem using ScreenMenuBar
8003400client-libsJTree scrolling problem when using large model in WindowsLookAndFeel.
8003830client-libsNullPointerException in BasicTreeUI.Actions when getPathBounds returns null
8004298client-libsNPE in WindowsTreeUI.ensureRowsAreVisible
8004866client-libs[macosx] HiDPI support in Aqua L&F
8005019client-libsJTable passes row index instead of length when inserts selection interval
8007006client-libs[macosx] Closing subwindow loses main window menus.
8008366client-libs[macosx] ActionListener called twice for JMenuItem using ScreenMenuBar
8013370client-libsNull pointer exception when adding more than 9 accelators to a JMenuBar
7038105core-libsFile.isHidden() should return true for pagefile.sys and hiberfil.sys
8003992core-libsFile and other classes in java.io do not handle embedded nulls properly
8007609core-libsWinNTFileSystem_md.c should correctly check value returned from realloc
8011950core-libsjava.io.File.createTempFile enters infinite loop when passed invalid data
8016063core-libsgetFinalAttributes should use FindClose
7103957core-libsNegativeArraySizeException while initializing class IntegerCache
7193463core-libsTerminator.setup should ignore IAE when registering signal handlers
8000817core-libsReinstate accidentally removed sleep() from ProcessBuilder/Basic.java
8003228core-libs(props) sun.jnu.encoding should be set to UTF-8 [macosx]
8016046core-libs(process) Strict validation of input should be security manager case only [win]
8021946core-libsDisabling sun.reflect.Reflection.getCallerCaller(int) by default breaks several frameworks and libraries
6984705core-libsJSR 292 method handle creation should not go through JNI
7058630core-libsJSR 292 method handle proxy violates contract for Object methods
8005345core-libsJSR 292: JDK performance tweaks
8016814core-libssun.reflect.Reflection.getCallerClass returns the wrong stack frame
6512101core-libsNetworkInterface#getDisplayName() method returns wrong encoding for Japanese OS
6953455core-libsCookieStore.add() cannot handle null URI parameter, contrary to the API specification
7078386core-libsNetworkInterface.getNetworkInterfaces() may return corrupted results on linux
7084560core-libsCrash in net.dll
7118907core-libsInetAddress.isReachable() should return false if sendto fails with EHOSTUNREACH
7163874core-libsInetAddress.isReachable should support pinging 0.0.0.0
7181353core-libsUpdate error message to distinguish native OOM and java OOM in net
7188755core-libsCrash due to missing synchronization on gconf_client in DefaultProxySelector.c
7190254core-libsNetworkInterface getFlags implementation should support full integer bit range for flags value
7199219core-libsProxy-Connection headers set incorrectly when a HttpClient is retrieved from the Keep Alive Cache
7199862core-libsMake sure that a connection is still alive when retrieved from KeepAliveCache in certain cases
8000525core-libsJava.net.httpcookie api does not support 2-digit year format
8007315core-libsHttpURLConnection.filterHeaderField method returns null where empty string is expected
8009650core-libsHttpClient available() check throws SocketException when connection has been closed
8010282core-libssun.net.www.protocol.jar.JarFileFactory.close(JarFile) should be thread-safe
8011234core-libsPerformance regression with ftp protocol when uploading in image mode
8013140core-libsHeap corruption with NetworkInterface.getByInetAddress() and long i/f name
6429204core-libs(se) Concurrent Selector.register and SelectionKey.interestOps can ignore interestOps
6633549core-libs(dc) Include-mode filtering of IPv6 sources does not block datagrams on Linux
7115070core-libs(fs) lookupPrincipalByName/lookupPrincipalByGroupName should treat ESRCH as not found.
7129029core-libs(fs) Unix file system provider should be buildable on platforms that don't support O_NOFOLLOW
7132889core-libs(se) AbstractSelectableChannel.register and configureBlocking not safe from asynchronous close
7146506core-libs(fc) Add EACCES check to the return of fcntl native method
7152948core-libs(dc) DatagramDispatcher.c should memset msghdr to make it portable to other platforms
7156873core-libs(zipfs) FileSystems.newFileSystem(uri, env) fails for uri with escaped octets
7157656core-libs(zipfs) SeekableByteChannel to entry in zip file always reports its position as 0
7166048core-libs(se) EPollArrayWrapper.c no longer needs to define epoll data structures
7168172core-libs(fs) Files.isReadable slow on Windows
7172826core-libs(se) Selector based on the Solaris event port mechanism
7179305core-libs(fs) Method name sun.nio.fs.UnixPath.getPathForExecptionMessage is misspelled
7190219core-libs(bf) CharBuffer.put(String,int,int) modifies position even if BufferOverflowException thrown
7190897core-libs(fs) Files.isWritable method returns false when the path is writable (win)
7191556core-libs(fs) UnixNativeDispatcher.getextmntent should be moved into platform specific code
7191587core-libs(se) SelectionKey.interestOps does not defer changing the interest set to the next select [macosx]
8002390core-libs(zipfs) Problems moving files between zip file systems
8009751core-libs(se) Selector spin when select, close and interestOps(0) invoked at same time (lnx)
8011128core-libs(fs) Files.createDirectory fails if the resoved path is exactly 248 characters long
8012019core-libs(fc) Thread.interrupt triggers hang in FileChannelImpl.pread (win)
6183404core-libsMany eudc characters are incorrectly mapped in MS936 and GBK converter
6610897core-libsNew constructor in sun.tools.java.ClassPath builds a path using File.separator instead of File.pathS
7187876core-libsClassCastException in TCPTransport.executeAcceptLoop
7131459core-libs[Fmt-De] DecimalFormat produces wrong format() results when close to a tie
7163865core-libsPerformance improvement for DateFormatSymbols.getZoneIndex(String)
8000529core-libsRegression : SimpleDateFormat incorrectly parses dates formatted with Z and z pattern letters
8005277core-libsRegression in JDK 7 in Bidi implementation
8020054core-libs(tz) Support tzdata2013d
7164256core-libsEnumMap clone doesn't clear the entrySet keeping a reference to the original Map
7166055core-libsJavadoc for WeakHashMap contains misleading advice
7198073core-libs(prefs) user prefs not saved [macosx]
8011200core-libs(coll) Optimize empty ArrayList and HashMap
8019381core-libsHashMap.isEmpty is non-final, potential issues for get/remove
7132378core-libsRace in FutureTask if used with explicit set and get ( not Runnable )
7161229core-libsPriorityBlockingQueue keeps hard reference to last removed element
7110151core-libsTo use underlying platform's zlib library for Java zlib support
7166955core-libs(pack200) JNI_GetCreatedJavaVMs needs additional checking
7188852core-libsMove implementation of De/Inflater.getBytesRead/Writtten() to java from native
8005466core-libsJAR file entry hash table uses too much memory (zip_util.c)
7163898core-libsadd isLoggable() check to doLog()
8010309core-libsImprove PlatformLogger.isLoggable performance by direct mapping from an integer to Level
8017174core-libsNPE when using Logger.getAnonymousLogger or LogManager.getLogManager().getLogger
8020228core-libsRestore the translated version of logging_xx.properties
7042126core-libs(alt-rt) HashMap.clone implementation should be re-examined
8006593core-libsInitialization bottleneck in Maps due to use of j.u.Random
7094176core-libs(tz) Incorrect TimeZone display name when DST not applicable / disabled
8009638core-libsWrong comment for PL in LocaleISOData, 1989 forward Poland is Republic of Poland
8015570core-libsUse long comparison in Rule.getRules().
7174887core-libsDeadlock in jndi ldap connection cleanup
8000487core-libsJava JNDI connection library on ldap conn is not honoring configured timeout
7110104core-svcIt should be possible to stop and start JMX Agent at runtime.
7164191core-svcproperties.putAll API may fail with ConcurrentModifcationException on multi-thread scenario
7173044core-svcMemory monitor demo hangs the system if MemoryUsage obj returns -1 .
8015604core-svcJDP packets containing ideographic characters are broken
8001621core-svcUpdate awk scripts that check output from jps/jcmd
8002048core-svcProtocol for discovery of manageable Java processes on a network
8008089core-svcDelete OS dependent check in JdkFinder.getExecutable()
8003192deployNeed to be able to launch 'About Java' from command line
8017164deployInvalid URL to GetJava web page could be formed in deployJava.js in some cases
8020390deployLSP: LocalSecurityPolicy is initialized too soon
8021585deploySetting trace level 5 in console does not enable all tracing.
8021907deployDRS: certificate element algorithm is supposed to default to SHA-256
8008377deployhttps dialog: 'More information' is open below the main dialog on Linux
8020941deployDRS: Make ruleset element version attribute mandatory
8006165deployfirefox freeze with java.com version detect applet
8010636deployUser responsibilities are not updated with all clsid's with jre 6u32 and higher
8015640deployREGRESSION: Security boxes appear 2 times with uppercase jnlp codebase
8015842deployMulti JREs: Unable to use the selected version to load an non-jnlp applet
8016005deployRemote debugging for applets in a browser is no longer working
8016225deployThe behavior after System.exit() is different between JRE 1.7_21 and JRE 1.7_17
8017218deployREGRESSION:Fail to detect Java after upgrade to 7u25 on IE (PnP fails to register plugin in IE)
8017249deployPlug-in does not report version
8019177deploygetdocument base should behave the same as getcodebase for file applets
8019425deployLocal Security Policy: Any "run" rule must have at least one application qualifier
8019870deployJCP shows link to security policy when one doesn't exist
8020160deployLSP: rename LocalSecurityPolicy (LSP) to DeploymentRuleSet (DRS)
8022042deployJava Plugin Runtime parameter for setting classpath does not work
8000555deployBasicService.showDocument() API fails to launch the browser in Windows XP
8009768deploy-XX:MaxGCPauseMillis value set in control panel is ignored by javaws
8010014deployUnable to execute javaws -uninstall
8017776deploySwing Event Thread does not use JNLP class loader
8000692embeddedRemove old KERNEL code
8005722embeddedAssert in c1_LIR.hpp incorrect wrt to number of register operands
7171028globalizationdots are missed in the datetime for Slovanian
7189611globalizationVenezuela current Currency should be Bs.F.
6340864hotspotImplement vectorization optimizations in hotspot-server
6443505hotspotIdeal() function for CmpLTMask
6658428hotspotC2 doesn't inline java method if corresponding intrinsic failed to inline.
6711908hotspotJVM needs direct access to some annotations
6910461hotspotRegister allocator may insert spill code at wrong insertion index
6910464hotspotLookupswitch and Tableswitch default branches not recognized as safepoints
7023639hotspotJSR 292 method handle invocation needs a fast path for compiled code
7023898hotspotIntrinsify AtomicLongFieldUpdater.getAndIncrement()
7092905hotspotC2: Keep track of the number of dead nodes
7119644hotspotIncrease superword's vector size up to 256 bits
7145024hotspotCrashes in ucrypto related to C2
7147064hotspotassert(allocates2(pc)) failed: not in CodeBuffer memory: 0xffffffff778d9d60 <= 0xffffffff778da69c <=
7147416hotspotLogCompilation tool does not work with post parse inlining
7147464hotspotJava crashed while executing method with over 8k of dneg operations
7147740hotspotadd assertions to check stack alignment on VM entry from generated code (x64)
7147744hotspotCTW: assert(false) failed: infinite EA connection graph build
7148109hotspotC2 compiler consumes too much heap resources
7148486hotspotAt a method handle call returning with an exception may call the runtime with misaligned stack (x64)
7152955hotspotprint_method crashes with null root
7152957hotspotVM crashes with assert(false) failed: bad AD file
7152961hotspotInlineTree::should_not_inline may exit prematurely
7154997hotspotassert(false) failed: not G1 barrier raw StoreP
7161796hotspotPhaseStringOpts::fetch_static_field tries to fetch field from the Klass instead of the mirror
7162094hotspotLateInlineCallGenerator::do_late_inline crashed on uninitialized _call_node
7169782hotspotC2: SIGSEGV in LShiftLNode::Ideal(PhaseGVN*, bool)
7169934hotspotpow(x,y) or x64 computes incorrect result when x<0 and y is an odd integer
7170053hotspotcrash in C2 when using -XX:+CountCompiledCalls
7170463hotspotC2 should recognize "obj.getClass() == A.class" code pattern
7171890hotspotC1: add Class.isInstance intrinsic
7172640hotspotC2: instrinsic implementations in LibraryCallKit should use argument() instead of pop()
7172843hotspotC1: fix "assert(has_printable_bci()) failed: _printable_bci should have been set"
7173340hotspotC2: code cleanup: use PhaseIterGVN::replace_edge(Node*, int, Node*) where applicable
7174218hotspotremove AtomicLongCSImpl intrinsics
7177003hotspotC1: LogCompilation support
7177923hotspotSIGBUS on sparc in compiled code for java.util.Calendar.clear()
7181658hotspotCTW: assert(t->meet(t0) == t) failed: Not monotonic
7187454hotspotstack overflow in C2 compiler thread on Solaris x86
7188276hotspotJSR 292: assert(ct == T_OBJECT) failed: rt=T_OBJECT, ct=13
7190310hotspotInlining WeakReference.get(), and hoisting $referent may lead to non-terminating loops
7192167hotspotJSR 292: C1 has old broken code which needs to be removed
7192406hotspotJSR 292: C2 needs exact return type information for invokedynamic and invokehandle call sites
7192963hotspotassert(_in[req-1] == this) failed: Must pass arg count to 'new'
7192964hotspotassert(false) failed: bad AD file
7192965hotspotassert(is_aligned_sets(size)) failed: mask is not aligned, adjacent sets
7193318hotspotC2: remove number of inputs requirement from Node's new operator
7196242hotspotJSR 292: vm/mlvm/indy/stress/java/loopsAndThreads crashed
7197033hotspotmissing ResourceMark for assert in Method::bci_from()
7198499hotspotTraceTypeProfile as diagnostic option
7199010hotspotincorrect vector alignment
7200001hotspotfailed C1 OSR compile doesn't get recompiled with C2
7200163hotspotadd CodeComments functionality to assember stubs
7200233hotspotC2: can't use expand rules for vector instruction rules
7201026hotspotadd vector for shift's count
8000232hotspotNPG: SIGSEGV in Dependencies::DepStream::check_klass_dependency on solaris-x64
8000263hotspotJSR 292: signature types may appear to be unloaded
8000313hotspotC2 should use jlong for 64bit values
8000592hotspotImprove adlc usability
8000740hotspotremove LinkWellKnownClasses
8000805hotspotJMM issue: short loads are non-atomic
8000821hotspotJSR 292: C1 fails to call virtual method (JRUBY-6920)
8001077hotspotremove ciMethod::will_link
8001101hotspotC2: more general vector rule subsetting
8001183hotspotincorrect results of char vectors right shift operaiton
8001635hotspotassert(in_bb(n)) failed: must be
8002294hotspotassert(VM_Version::supports_ssse3()) failed:
8003135hotspotHotSpot inlines and hoists the Thread.currentThread().isInterrupted() out of the loop
8003983hotspotLogCompilation tool is broken since c1 support
8004741hotspotMissing compiled exception handle table entry for multidimensional array allocation
8004835hotspotImprove AES intrinsics on x86
8005033hotspotclear high word for integer pop count on SPARC
8005055hotspotpass outputStream to more opto debug routines
8005418hotspotJSR 292: virtual dispatch bug in 292 impl
8005419hotspotImprove intrinsics code performance on x86 by using AVX2
8005439hotspotno message about inline method if it specifed by CompileCommand
8005522hotspotuse fast-string instructions on x86 for zeroing
8005544hotspotUse 256bit YMM registers in arraycopy stubs on x86
8005821hotspotC2: -XX:+PrintIntrinsics is broken
8005956hotspotC2: assert(!def_outside->member(r)) failed: Use of external LRG overlaps the same LRG defined in this block
8006031hotspotLibraryCallKit::inline_array_copyOf disabled unintentionally with 7172640
8006095hotspotC1: SIGSEGV w/ -XX:+LogCompilation
8006430hotspotTraceTypeProfile is a product flag while it should be a diagnostic flag
8006807hotspotC2 crash due to out of bounds array access in Parse::do_multianewarray
8007144hotspotIncremental inlining mistakes some call sites for dead ones and doesn't inline them
8007294hotspotReduceFieldZeroing doesn't check for dependent load and can lead to incorrect execution
8007402hotspotCode cleanup to remove Parfait false positive
8007439hotspotC2: adding successful message of inlining
8007959hotspotUse expensive node logic for more math nodes
8008555hotspotDebugging code in compiled method sometimes leaks memory
8009460hotspotC2compiler crash in machnode::in_regmask(unsigned int)
8009472hotspotPrint additional information for 8004640 failure.
8009761hotspotDeoptimization on sparc doesn't set Llast_SP correctly in the interpreter frames it creates
8010437hotspotguarantee(this->is8bit(imm8)) failed: Short forward jump exceeds 8-bit offset
8010770hotspotZero: back port of 8000780 to HS24 broke JSR 292
8011102hotspotClear AVX registers after return from JNI call
8011901hotspotUnsafe.getAndAddLong(obj, off, delta) does not work properly with long deltas
8014189hotspotJVM crash with SEGV in ConnectionGraph::record_for_escape_analysis()
8016157hotspotDuring CTW: C2: assert(!def_outside->member(r)) failed: Use of external LRG overlaps the same LRG defined in this block
8020215hotspotDifferent execution plan when using JIT vs interpreter
8020433hotspotCrash when using -XX:+RestoreMXCSROnJNICalls
4988100hotspotoop_verify_old_oop appears to be dead
6725714hotspotpar compact - add a table to speed up bitmap searches
6761744hotspotHotspot crashes if process size limit is exceeded
6818524hotspotG1: use ergonomic resizing of PLABs
6921087hotspotG1: remove per-GC-thread expansion tables from the fine-grain remembered sets
7041879hotspotG1: introduce stress testing parameter to cause frequent evacuation failures
7068625hotspotTesting 8 bytes of card table entries at a time speeds up card-scanning
7114678hotspotG1: various small fixes, code cleanup, and refactoring
7122222hotspotGC log is limited to 2G for 32-bit
7127697hotspotG1: remove dead code after recent concurrent mark changes
7130974hotspotG1: Remove G1ParCopyHelper
7131629hotspotGeneralize the CMS free list code
7143490hotspotG1: Remove HeapRegion::_top_at_conc_mark_count
7143511hotspotG1: Another instance of high GC Worker Other time (50ms)
7143858hotspotG1: Back to back young GCs with the second GC having a minimally sized eden
7145441hotspotG1: collection set chooser-related cleanup
7146246hotspotG1: expose some of the -XX flags that drive which old regions to collect during mixed GCs
7147724hotspotG1: hang in SurrogateLockerThread::manipulatePLL
7151089hotspotPS NUMA: NUMA allocator should not attempt to free pages when using SHM large pages
7152791hotspotwbapi tests fail on cygwin
7157073hotspotG1: type change size_t -> uint for region counts / indexes
7158457hotspotstress: jdk7 u4 core dumps during megacart stress test run
7158682hotspotG1: Handle leak when running nsk.sysdict tests
7160613hotspotVerifyRememberedSets doesn't work with CompressedOops
7163848hotspotG1: Log GC Cause for a GC
7167437hotspotCan't build on linux without precompiled headers
7168294hotspotG1: Some Full GCs incorrectly report GC cause as "No GC"
7169056hotspotAdd gigabyte unit to proper_unit_for_byte_size() and byte_size_in_proper_unit()
7169062hotspotCMS: Assertion failed with -XX:+ObjectAlignmentInBytes=64
7171936hotspotLOG_G incorrectly defined in globalDefinitions.hpp
7172279hotspotG1: Clean up TraceGen0Time and TraceGen1Time data gathering
7172388hotspotG1: _total_full_collections should not be incremented for concurrent cycles
7173460hotspotG1: java/lang/management/MemoryMXBean/CollectionUsageThreshold.java failes with G1
7173712hotspotG1: Duplicated code in G1UpdateRSOrPushRefOopClosure::do_oop_nv()
7173959hotspotJvm crashed during coherence exabus (tmb) testing
7176220hotspot'Full GC' events miss date stamp information occasionally
7176479hotspotG1: JVM crashes on T5-8 system with 1.5 TB heap
7178361hotspotG1: Make sure that PrintGC and PrintGCDetails use the same timing for the GC pause
7182260hotspotG1: Fine grain RSet freeing bottleneck
7184772hotspotG1: Incorrect assert in HeapRegionLinkedList::add_as_head()
7185699hotspotG1: Prediction model discrepancies
7186737hotspotUnable to allocate bit maps or card tables for parallel gc for the requested heap
7188176hotspotThe JVM should differentiate between T and M series and adjust GC ergonomics
7192128hotspotG1: Extend fix for 6948537 to G1's BOT
7193157hotspotG1: Make some develpflags available in product builds
7194409hotspotos::javaTimeNanos() shows hot on CPU_CLK_UNHALTED profiles
7194633hotspotG1: Assertion and guarantee failures in block offset table
7197666hotspotjava -d64 -version core dumps in a box with lots of memory
7197906hotspotBlockOffsetArray::power_to_cards_back() needs to handle > 32 bit shifts
7198130hotspotG1: PrintReferenceGC output comes out of order
7200261hotspotG1: Liveness counting inconsistencies during marking verification
8000311hotspotG1: ParallelGCThreads==0 broken
8000831hotspotHeap verification output incorrect/incomplete
8001424hotspotG1: Rename certain G1-specific flags
8001425hotspotG1: Change the default values for certain G1 specific flags
8004170hotspotG1: Verbose GC output is not getting flushed to log file using JDK 8
8005032hotspotG1: Cleanup serial reference processing closures in concurrent marking
8006242hotspotG1: WorkerDataArray<T>::verify() too strict for double calculations
8006894hotspotG1: Number of marking threads missing from PrintFlagsFinal output
8006954hotspotGC Cause equals No GC for CMS background collection in the trace GC event
8007003hotspotParNew sends the heap summary too early
8007036hotspotG1: Too many old regions added to last mixed GC
8007221hotspotG1: concurrent phase durations do not state the time units ("secs")
8008546hotspotWRONG G1CONFIDENCEPERCENT RESULTS IN GUARANTEE(VARIANCE() > -1.0) FAILED
8008737hotspotThe trace event vm/gc/heap/summary is missing for CMS
8008790hotspotPromotion failed tracing event for all GCs
8008916hotspotG1: Evacuation failed tracing event
8008917hotspotCMS: Concurrent mode failure tracing event
8008918hotspotReference statistics events for the tracing framework